LINUX.ORG.RU

D-link DWA-525 A2 и Debian

 , ,


0

1

скачал я драйвера для D-link DWA-525 A2 и не могу их установить
команда make выдает

root@maxsever:/usr/src/DWA-525_A2_LinuxSTA_V2.6.1.0_1# make
make -C tools
make[1]: вход в каталог «/usr/src/DWA-525_A2_LinuxSTA_V2.6.1.0_1/tools»
gcc -g bin2h.c -o bin2h
make[1]: выход из каталога «/usr/src/DWA-525_A2_LinuxSTA_V2.6.1.0_1/tools»
/usr/src/DWA-525_A2_LinuxSTA_V2.6.1.0_1/tools/bin2h
cp -f os/linux/Makefile.6 /usr/src/DWA-525_A2_LinuxSTA_V2.6.1.0_1/os/linux/Makefile
make -C /lib/modules/3.16.0-4-amd64/build SUBDIRS=/usr/src/DWA-525_A2_LinuxSTA_V2.6.1.0_1/os/linux modules
make[1]: вход в каталог «/usr/src/linux-headers-3.16.0-4-amd64»
make[1]: Entering directory `/usr/src/linux-headers-3.16.0-4-amd64'
  CC [M]  /usr/src/DWA-525_A2_LinuxSTA_V2.6.1.0_1/os/linux/../../os/linux/rt_linux.o
/usr/src/linux-headers-3.16.0-4-common/scripts/Makefile.build:262: ошибка выполнения рецепта для цели «/usr/src/DWA-525_A2_LinuxSTA_V2.6.1.0_1/os/linux/../../os/linux/rt_linux.o»
/usr/src/linux-headers-3.16.0-4-common/Makefile:1352: ошибка выполнения рецепта для цели «_module_/usr/src/DWA-525_A2_LinuxSTA_V2.6.1.0_1/os/linux»
Makefile:181: ошибка выполнения рецепта для цели «sub-make»
Makefile:8: ошибка выполнения рецепта для цели «all»
make[1]: выход из каталога «/usr/src/linux-headers-3.16.0-4-amd64»
Makefile:381: ошибка выполнения рецепта для цели «LINUX»

Если что, команда make выполнялась раньше несколько раз

lspci -knn

00:00.0 Host bridge [0600]: Advanced Micro Devices, Inc. [AMD] RS880 Host Bridge [1022:9601]
	Subsystem: Advanced Micro Devices, Inc. [AMD] RS880 Host Bridge [1022:9601]
00:02.0 PCI bridge [0604]: Advanced Micro Devices, Inc. [AMD] RS780 PCI to PCI bridge (ext gfx port 0) [1022:9603]
	Kernel driver in use: pcieport
00:06.0 PCI bridge [0604]: Advanced Micro Devices, Inc. [AMD] RS780 PCI to PCI bridge (PCIE port 2) [1022:9606]
	Kernel driver in use: pcieport
00:11.0 SATA controller [0106]: Advanced Micro Devices, Inc. [AMD/ATI] SB7x0/SB8x0/SB9x0 SATA Controller [AHCI mode] [1002:4391]
	Subsystem: Gigabyte Technology Co., Ltd Device [1458:b002]
	Kernel driver in use: ahci
00:12.0 USB controller [0c03]: Advanced Micro Devices, Inc. [AMD/ATI] SB7x0/SB8x0/SB9x0 USB OHCI0 Controller [1002:4397]
	Subsystem: Gigabyte Technology Co., Ltd Device [1458:5004]
	Kernel driver in use: ohci-pci
00:12.1 USB controller [0c03]: Advanced Micro Devices, Inc. [AMD/ATI] SB7x0 USB OHCI1 Controller [1002:4398]
	Subsystem: Gigabyte Technology Co., Ltd Device [1458:5004]
	Kernel driver in use: ohci-pci
00:12.2 USB controller [0c03]: Advanced Micro Devices, Inc. [AMD/ATI] SB7x0/SB8x0/SB9x0 USB EHCI Controller [1002:4396]
	Subsystem: Gigabyte Technology Co., Ltd Device [1458:5004]
	Kernel driver in use: ehci-pci
00:13.0 USB controller [0c03]: Advanced Micro Devices, Inc. [AMD/ATI] SB7x0/SB8x0/SB9x0 USB OHCI0 Controller [1002:4397]
	Subsystem: Gigabyte Technology Co., Ltd Device [1458:5004]
	Kernel driver in use: ohci-pci
00:13.1 USB controller [0c03]: Advanced Micro Devices, Inc. [AMD/ATI] SB7x0 USB OHCI1 Controller [1002:4398]
	Subsystem: Gigabyte Technology Co., Ltd Device [1458:5004]
	Kernel driver in use: ohci-pci
00:13.2 USB controller [0c03]: Advanced Micro Devices, Inc. [AMD/ATI] SB7x0/SB8x0/SB9x0 USB EHCI Controller [1002:4396]
	Subsystem: Gigabyte Technology Co., Ltd Device [1458:5004]
	Kernel driver in use: ehci-pci
00:14.0 SMBus [0c05]: Advanced Micro Devices, Inc. [AMD/ATI] SBx00 SMBus Controller [1002:4385] (rev 3c)
	Subsystem: Gigabyte Technology Co., Ltd GA-MA770-DS3rev2.0 Motherboard [1458:4385]
00:14.1 IDE interface [0101]: Advanced Micro Devices, Inc. [AMD/ATI] SB7x0/SB8x0/SB9x0 IDE Controller [1002:439c]
	Subsystem: Gigabyte Technology Co., Ltd Device [1458:5002]
	Kernel driver in use: pata_atiixp
00:14.2 Audio device [0403]: Advanced Micro Devices, Inc. [AMD/ATI] SBx00 Azalia (Intel HDA) [1002:4383]
	Subsystem: Gigabyte Technology Co., Ltd Device [1458:a002]
	Kernel driver in use: snd_hda_intel
00:14.3 ISA bridge [0601]: Advanced Micro Devices, Inc. [AMD/ATI] SB7x0/SB8x0/SB9x0 LPC host controller [1002:439d]
	Subsystem: Advanced Micro Devices, Inc. [AMD/ATI] SB7x0/SB8x0/SB9x0 LPC host controller [1002:439d]
00:14.4 PCI bridge [0604]: Advanced Micro Devices, Inc. [AMD/ATI] SBx00 PCI to PCI Bridge [1002:4384]
00:14.5 USB controller [0c03]: Advanced Micro Devices, Inc. [AMD/ATI] SB7x0/SB8x0/SB9x0 USB OHCI2 Controller [1002:4399]
	Subsystem: Gigabyte Technology Co., Ltd Device [1458:5004]
	Kernel driver in use: ohci-pci
00:18.0 Host bridge [0600]: Advanced Micro Devices, Inc. [AMD] Family 10h Processor HyperTransport Configuration [1022:1200]
00:18.1 Host bridge [0600]: Advanced Micro Devices, Inc. [AMD] Family 10h Processor Address Map [1022:1201]
00:18.2 Host bridge [0600]: Advanced Micro Devices, Inc. [AMD] Family 10h Processor DRAM Controller [1022:1202]
00:18.3 Host bridge [0600]: Advanced Micro Devices, Inc. [AMD] Family 10h Processor Miscellaneous Control [1022:1203]
	Kernel driver in use: k10temp
00:18.4 Host bridge [0600]: Advanced Micro Devices, Inc. [AMD] Family 10h Processor Link Control [1022:1204]
01:00.0 VGA compatible controller [0300]: Advanced Micro Devices, Inc. [AMD/ATI] Turks XT [Radeon HD 6670/7670] [1002:6758]
	Subsystem: PC Partner Limited / Sapphire Technology Device [174b:e198]
	Kernel driver in use: radeon
01:00.1 Audio device [0403]: Advanced Micro Devices, Inc. [AMD/ATI] Turks/Whistler HDMI Audio [Radeon HD 6000 Series] [1002:aa90]
	Subsystem: PC Partner Limited / Sapphire Technology Device [174b:aa90]
	Kernel driver in use: snd_hda_intel
02:00.0 Ethernet controller [0200]: Qualcomm Atheros AR8151 v2.0 Gigabit Ethernet [1969:1083] (rev c0)
	Subsystem: Gigabyte Technology Co., Ltd Device [1458:e000]
	Kernel driver in use: atl1c
03:06.0 Network controller [0280]: Ralink corp. RT5360 Wireless 802.11n 1T/1R [1814:5360]
	Subsystem: D-Link System Inc DWA-525 Wireless N 150 Desktop Adapter (rev.A2) [1186:3c05]

Старый вывод команды make (по-моему,он испорчен)

root@maxsever:/usr/src/DWA-525_A2_LinuxSTA_V2.6.1.0_1# make
make -C tools
make[1]: вход в каталог «/usr/src/DWA-525_A2_LinuxSTA_V2.6.1.0_1/tools»
gcc -g bin2h.c -o bin2h
make[1]: выход из каталога «/usr/src/DWA-525_A2_LinuxSTA_V2.6.1.0_1/tools»
/usr/src/DWA-525_A2_LinuxSTA_V2.6.1.0_1/tools/bin2h
cp -f os/linux/Makefile.6 /usr/src/DWA-525_A2_LinuxSTA_V2.6.1.0_1/os/linux/Makefile
make -C /lib/modules/3.16.0-4-amd64/build SUBDIRS=/usr/src/DWA-525_A2_LinuxSTA_V2.6.1.0_1/os/linux modules
make[1]: вход в каталог «/usr/src/linux-headers-3.16.0-4-amd64»
Makefile:10: *** mixed implicit and normal rules: deprecated syntax
make[1]: Entering directory `/usr/src/linux-headers-3.16.0-4-amd64'
  CC [M]  /usr/src/DWA-525_A2_LinuxSTA_V2.6.1.0_1/os/linux/../../os/linux/rt_linux.o
In file included from /usr/src/DWA-525_A2_LinuxSTA_V2.6.1.0_1/include/rtmp_os.h:44:0,
                 from /usr/src/DWA-525_A2_LinuxSTA_V2.6.1.0_1/include/rtmp_comm.h:69,
                 from /usr/src/DWA-525_A2_LinuxSTA_V2.6.1.0_1/os/linux/../../os/linux/rt_linux.c:32:
/usr/src/DWA-525_A2_LinuxSTA_V2.6.1.0_1/os/linux/../../os/linux/rt_linux.c: In function ‘duplicate_pkt’:
/usr/src/DWA-525_A2_LinuxSTA_V2.6.1.0_1/os/linux/../../os/linux/rt_linux.c:505:18: warning: passing argument 1 of ‘memmove’ makes pointer from integer without a cast
   NdisMoveMemory(skb->tail, pHeader802_3, HdrLen);
                  ^
/usr/src/DWA-525_A2_LinuxSTA_V2.6.1.0_1/include/os/rt_linux.h:474:61: note: in definition of macro ‘NdisMoveMemory’
 #define NdisMoveMemory(Destination, Source, Length) memmove(Destination, Source, Length)
                                                             ^
In file included from /usr/src/linux-headers-3.16.0-4-common/arch/x86/include/asm/string.h:4:0,
                 from /usr/src/linux-headers-3.16.0-4-common/include/linux/string.h:17,
                 from /usr/src/linux-headers-3.16.0-4-common/include/linux/bitmap.h:8,
                 from /usr/src/linux-headers-3.16.0-4-common/include/linux/cpumask.h:11,
                 from /usr/src/linux-headers-3.16.0-4-common/arch/x86/include/asm/cpumask.h:4,
                 from /usr/src/linux-headers-3.16.0-4-common/arch/x86/include/asm/msr.h:10,
                 from /usr/src/linux-headers-3.16.0-4-common/arch/x86/include/asm/processor.h:20,
                 from /usr/src/linux-headers-3.16.0-4-common/arch/x86/include/asm/thread_info.h:23,
                 from /usr/src/linux-headers-3.16.0-4-common/include/linux/thread_info.h:54,
                 from /usr/src/linux-headers-3.16.0-4-common/arch/x86/include/asm/preempt.h:6,
                 from /usr/src/linux-headers-3.16.0-4-common/include/linux/preempt.h:18,
                 from /usr/src/linux-headers-3.16.0-4-common/include/linux/spinlock.h:50,
                 from /usr/src/linux-headers-3.16.0-4-common/include/linux/seqlock.h:35,
                 from /usr/src/linux-headers-3.16.0-4-common/include/linux/time.h:5,
                 from /usr/src/linux-headers-3.16.0-4-common/include/linux/stat.h:18,
                 from /usr/src/linux-headers-3.16.0-4-common/include/linux/module.h:10,
                 from /usr/src/DWA-525_A2_LinuxSTA_V2.6.1.0_1/include/os/rt_linux.h:31,
                 from /usr/src/DWA-525_A2_LinuxSTA_V2.6.1.0_1/include/rtmp_os.h:44,
                 from /usr/src/DWA-525_A2_LinuxSTA_V2.6.1.0_1/include/rtmp_comm.h:69,
                 from /usr/src/DWA-525_A2_LinuxSTA_V2.6.1.0_1/os/linux/../../os/linux/rt_linux.c:32:
/usr/src/linux-headers-3.16.0-4-common/arch/x86/include/asm/string_64.h:58:7: note: expected ‘void *’ but argument is of type ‘sk_buff_data_t’
 void *memmove(void *dest, const void *src, size_t count);
       ^
In file included from /usr/src/DWA-525_A2_LinuxSTA_V2.6.1.0_1/include/rtmp_os.h:44:0,
                 from /usr/src/DWA-525_A2_LinuxSTA_V2.6.1.0_1/include/rtmp_comm.h:69,
                 from /usr/src/DWA-525_A2_LinuxSTA_V2.6.1.0_1/os/linux/../../os/linux/rt_linux.c:32:
/usr/src/DWA-525_A2_LinuxSTA_V2.6.1.0_1/os/linux/../../os/linux/rt_linux.c:507:18: warning: passing argument 1 of ‘memmove’ makes pointer from integer without a cast
   NdisMoveMemory(skb->tail, pData, DataSize);
                  ^
/usr/src/DWA-525_A2_LinuxSTA_V2.6.1.0_1/include/os/rt_linux.h:474:61: note: in definition of macro ‘NdisMoveMemory’
 #define NdisMoveMemory(Destination, Source, Length) memmove(Destination, Source, Length)
                                                             ^
In file included from /usr/src/linux-headers-3.16.0-4-common/arch/x86/include/asm/string.h:4:0,
                 from /usr/src/linux-headers-3.16.0-4-common/include/linux/string.h:17,
                 from /usr/src/linux-headers-3.16.0-4-common/include/linux/bitmap.h:8,
                 from /usr/src/linux-headers-3.16.0-4-common/include/linux/cpumask.h:11,
                 from /usr/src/linux-headers-3.16.0-4-common/arch/x86/include/asm/cpumask.h:4,
                 from /usr/src/linux-headers-3.16.0-4-common/arch/x86/include/asm/msr.h:10,
                 from /usr/src/linux-headers-3.16.0-4-common/arch/x86/include/asm/processor.h:20,
                 from /usr/src/linux-headers-3.16.0-4-common/arch/x86/include/asm/thread_info.h:23,
                 from /usr/src/linux-headers-3.16.0-4-common/include/linux/thread_info.h:54,
                 from /usr/src/linux-headers-3.16.0-4-common/arch/x86/include/asm/preempt.h:6,
                 from /usr/src/linux-headers-3.16.0-4-common/include/linux/preempt.h:18,
                 from /usr/src/linux-headers-3.16.0-4-common/include/linux/spinlock.h:50,
                 from /usr/src/linux-headers-3.16.0-4-common/include/linux/seqlock.h:35,
                 from /usr/src/linux-headers-3.16.0-4-common/include/linux/time.h:5,
                 from /usr/src/linux-headers-3.16.0-4-common/include/linux/stat.h:18,
                 from /usr/src/linux-headers-3.16.0-4-common/include/linux/module.h:10,
                 from /usr/src/DWA-525_A2_LinuxSTA_V2.6.1.0_1/include/os/rt_linux.h:31,
                 from /usr/src/DWA-525_A2_LinuxSTA_V2.6.1.0_1/include/rtmp_os.h:44,
                 from /usr/src/DWA-525_A2_LinuxSTA_V2.6.1.0_1/include/rtmp_comm.h:69,
                 from /usr/src/DWA-525_A2_LinuxSTA_V2.6.1.0_1/os/linux/../../os/linux/rt_linux.c:32:
/usr/src/linux-headers-3.16.0-4-common/arch/x86/include/asm/string_64.h:58:7: note: expected ‘void *’ but argument is of type ‘sk_buff_data_t’
 void *memmove(void *dest, const void *src, size_t count);
       ^
/usr/src/DWA-525_A2_LinuxSTA_V2.6.1.0_1/os/linux/../../os/linux/rt_linux.c: In function ‘ClonePacket’:
/usr/src/DWA-525_A2_LinuxSTA_V2.6.1.0_1/os/linux/../../os/linux/rt_linux.c:659:20: warning: assignment makes integer from pointer without a cast
   pClonedPkt->tail = pClonedPkt->data + pClonedPkt->len;
                    ^
In file included from /usr/src/DWA-525_A2_LinuxSTA_V2.6.1.0_1/include/rtmp_os.h:44:0,
                 from /usr/src/DWA-525_A2_LinuxSTA_V2.6.1.0_1/include/rtmp_comm.h:69,
                 from /usr/src/DWA-525_A2_LinuxSTA_V2.6.1.0_1/os/linux/../../os/linux/rt_linux.c:32:
/usr/src/DWA-525_A2_LinuxSTA_V2.6.1.0_1/os/linux/../../os/linux/rt_linux.c: In function ‘RtmpOsPktInit’:
/usr/src/DWA-525_A2_LinuxSTA_V2.6.1.0_1/include/os/rt_linux.h:1005:34: warning: assignment makes integer from pointer without a cast
   ((RTPKT_TO_OSPKT(_pkt))->tail) = (PUCHAR)((_start) + (_len))
                                  ^
/usr/src/DWA-525_A2_LinuxSTA_V2.6.1.0_1/os/linux/../../os/linux/rt_linux.c:678:2: note: in expansion of macro ‘SET_OS_PKT_DATATAIL’
  SET_OS_PKT_DATATAIL(pRxPkt, pData, DataSize);
  ^
/usr/src/DWA-525_A2_LinuxSTA_V2.6.1.0_1/os/linux/../../os/linux/rt_linux.c: In function ‘wlan_802_11_to_802_3_packet’:
/usr/src/DWA-525_A2_LinuxSTA_V2.6.1.0_1/os/linux/../../os/linux/rt_linux.c:705:15: warning: assignment makes integer from pointer without a cast
  pOSPkt->tail = pOSPkt->data + pOSPkt->len;
               ^
/usr/src/DWA-525_A2_LinuxSTA_V2.6.1.0_1/os/linux/../../os/linux/rt_linux.c: In function ‘__RtmpOSFSInfoChange’:
/usr/src/DWA-525_A2_LinuxSTA_V2.6.1.0_1/os/linux/../../os/linux/rt_linux.c:1133:20: error: incompatible types when assigning to type ‘int’ from type ‘kuid_t’
   pOSFSInfo->fsuid = current_fsuid();
                    ^
/usr/src/DWA-525_A2_LinuxSTA_V2.6.1.0_1/os/linux/../../os/linux/rt_linux.c:1134:20: error: incompatible types when assigning to type ‘int’ from type ‘kgid_t’
   pOSFSInfo->fsgid = current_fsgid();
                    ^
/usr/src/linux-headers-3.16.0-4-common/scripts/Makefile.build:262: ошибка выполнения рецепта для цели «/usr/src/DWA-525_A2_LinuxSTA_V2.6.1.0_1/os/linux/../../os/linux/rt_linux.o»
make[4]: *** [/usr/src/DWA-525_A2_LinuxSTA_V2.6.1.0_1/os/linux/../../os/linux/rt_linux.o] Ошибка 1
/usr/src/linux-headers-3.16.0-4-common/Makefile:1352: ошибка выполнения рецепта для цели «_module_/usr/src/DWA-525_A2_LinuxSTA_V2.6.1.0_1/os/linux»
make[3]: *** [_module_/usr/src/DWA-525_A2_LinuxSTA_V2.6.1.0_1/os/linux] Ошибка 2
Makefile:181: ошибка выполнения рецепта для цели «sub-make»
make[2]: *** [sub-make] Ошибка 2
Makefile:8: ошибка выполнения рецепта для цели «all»
make[1]: *** [all] Ошибка 2
make[1]: выход из каталога «/usr/src/linux-headers-3.16.0-4-amd64»
Makefile:381: ошибка выполнения рецепта для цели «LINUX»
make: *** [LINUX] Ошибка 2
root@maxsever:/usr/src/DWA-525_A2_LinuxSTA_V2.6.1.0_1#
cp -f os/linux/Makefile.6 /usr/src/DWA-525_A2_LinuxSTA_V2.6.1.0_1/os/linux/Makefile
make -C /lib/modules/3.16.0-4-amd64/build SUBDIRS=/usr/src/DWA-525_A2_LinuxSTA_V2.6.1.0_1/os/linux modules
make[1]: вход в каталог «/usr/src/linux-headers-3.16.0-4-amd64»
Makefile:10: *** mixed implicit and normal rules: deprecated syntax
make[1]: Entering directory `/usr/src/linux-headers-3.16.0-4-amd64'
  CC [M]  /usr/src/DWA-525_A2_LinuxSTA_V2.6.1.0_1/os/linux/../../os/linux/rt_linux.o
In file included from /usr/src/DWA-525_A2_LinuxSTA_V2.6.1.0_1/include/rtmp_os.h:44:0,
root@maxsever:/usr/src/DWA-525_A2_LinuxSTA_V2.6.1.0_1# root@maxsever:/usr/src/DWA-525_A2_LinuxSTA_V2.6.1.0_1# make
bash: root@maxsever:/usr/src/DWA-525_A2_LinuxSTA_V2.6.1.0_1#: Нет такого файла или каталога
root@maxsever:/usr/src/DWA-525_A2_LinuxSTA_V2.6.1.0_1# make -C tools
make: вход в каталог «/usr/src/DWA-525_A2_LinuxSTA_V2.6.1.0_1/tools»
gcc -g bin2h.c -o bin2h
make: выход из каталога «/usr/src/DWA-525_A2_LinuxSTA_V2.6.1.0_1/tools»
root@maxsever:/usr/src/DWA-525_A2_LinuxSTA_V2.6.1.0_1# make[1]: вход в каталог «/usr/src/DWA-525_A2_LinuxSTA_V2.6.1.0_1/tools»
bash: make[1]:: команда не найдена
root@maxsever:/usr/src/DWA-525_A2_LinuxSTA_V2.6.1.0_1# gcc -g bin2h.c -o bin2h
gcc: error: bin2h.c: Нет такого файла или каталога
gcc: fatal error: no input files
compilation terminated.
root@maxsever:/usr/src/DWA-525_A2_LinuxSTA_V2.6.1.0_1# make[1]: выход из каталога «/usr/src/DWA-525_A2_LinuxSTA_V2.6.1.0_1/tools»
bash: make[1]:: команда не найдена
root@maxsever:/usr/src/DWA-525_A2_LinuxSTA_V2.6.1.0_1# /usr/src/DWA-525_A2_LinuxSTA_V2.6.1.0_1/tools/bin2h
Environment value "RT28xx_DIR" not export
root@maxsever:/usr/src/DWA-525_A2_LinuxSTA_V2.6.1.0_1# cp -f os/linux/Makefile.6 /usr/src/DWA-525_A2_LinuxSTA_V2.6.1.0_1/os/linux/Makefile
root@maxsever:/usr/src/DWA-525_A2_LinuxSTA_V2.6.1.0_1# make -C /lib/modules/3.16.0-4-amd64/build SUBDIRS=/usr/src/DWA-525_A2_LinuxSTA_V2.6.1.0_1/os/linux modules
make: вход в каталог «/usr/src/linux-headers-3.16.0-4-amd64»
Makefile:10: *** mixed implicit and normal rules: deprecated syntax
make[1]: Entering directory `/usr/src/linux-headers-3.16.0-4-amd64'
/usr/src/DWA-525_A2_LinuxSTA_V2.6.1.0_1/os/linux/Makefile:1: /os/linux/config.mk: Нет такого файла или каталога
make[3]: *** Нет правила для сборки цели «/os/linux/config.mk».  Останов.
/usr/src/linux-headers-3.16.0-4-common/Makefile:1352: ошибка выполнения рецепта для цели «_module_/usr/src/DWA-525_A2_LinuxSTA_V2.6.1.0_1/os/linux»
make[2]: *** [_module_/usr/src/DWA-525_A2_LinuxSTA_V2.6.1.0_1/os/linux] Ошибка 2
Makefile:181: ошибка выполнения рецепта для цели «sub-make»
make[1]: *** [sub-make] Ошибка 2
Makefile:8: ошибка выполнения рецепта для цели «all»
make: *** [all] Ошибка 2
make: выход из каталога «/usr/src/linux-headers-3.16.0-4-amd64»

Здесь, пишут должна помочь установка пакета firmware-realtek

Wind ★★ ()
Вы не можете добавлять комментарии в эту тему. Тема перемещена в архив.