LINUX.ORG.RU

проблема с установкой pillow

 , ,


0

1

помогите пожалуйста решить проблему

на 64-разрядной машине есть linux mint и python3. пытаюсь установить pillow. команда

pip install pillow
скачивает эту библиотеку и начинает устанавливать. но этот процесс заканчивается сообщениями об ошибках
..........................
..............
x86_64-linux-gnu-gcc: error: build/temp.linux-x86_64-3.4/libImaging/TiffDecode.o: No such file or directory

x86_64-linux-gnu-gcc: error: build/temp.linux-x86_64-3.4/libImaging/Incremental.o: No such file or directory

x86_64-linux-gnu-gcc: error: build/temp.linux-x86_64-3.4/libImaging/Jpeg2KDecode.o: No such file or directory

x86_64-linux-gnu-gcc: error: build/temp.linux-x86_64-3.4/libImaging/Jpeg2KEncode.o: No such file or directory

error: command 'x86_64-linux-gnu-gcc' failed with exit status 1

----------------------------------------
Cleaning up...
Command /home/kalinins/.virtualenvs/drummersaransk/bin/python3 -c "import setuptools, tokenize;__file__='/home/kalinins/.virtualenvs/drummersaransk/build/pillow/setup.py';exec(compile(getattr(tokenize, 'open', open)(__file__).read().replace('\r\n', '\n'), __file__, 'exec'))" install --record /tmp/pip-0dnzqfg9-record/install-record.txt --single-version-externally-managed --compile --install-headers /home/kalinins/.virtualenvs/drummersaransk/include/site/python3.4 failed with error code 1 in /home/kalinins/.virtualenvs/drummersaransk/build/pillow
Storing debug log for failure in /home/kalinins/.pip/pip.log

помогите пожалуйста установить pillow

Скорее всего зависимости для библиотеки поставить надо. Что-то типо libjpeg-dev.

b0c0813f ()
Вы не можете добавлять комментарии в эту тему. Тема перемещена в архив.