LINUX.ORG.RU

Qmmp не собирается.


0

0

вроде все зависимости есть

cmake ./

-- // --

-- FLAC ON

--//--

а make выдает

/root/Deps/qmmp-0.1.3.1/lib/qmmp/Input/flac/decoder_flac.cpp: In function ‘int f
lac_decode(void*, char*, int)’:
/root/Deps/qmmp-0.1.3.1/lib/qmmp/Input/flac/decoder_flac.cpp:130: error: ‘FLAC__
stream_decoder_get_decode_position’ was not declared in this scope
/root/Deps/qmmp-0.1.3.1/lib/qmmp/Input/flac/decoder_flac.cpp: At global scope:
/root/Deps/qmmp-0.1.3.1/lib/qmmp/Input/flac/decoder_flac.cpp:199: error: ‘FLAC__
StreamDecoderTellStatus’ does not name a type
/root/Deps/qmmp-0.1.3.1/lib/qmmp/Input/flac/decoder_flac.cpp:207: error: ‘FLAC__                                            StreamDecoderSeekStatus’ does not name a type
/root/Deps/qmmp-0.1.3.1/lib/qmmp/Input/flac/decoder_flac.cpp:217: error: ‘FLAC__                                            StreamDecoderLengthStatus’ does not name a type
/root/Deps/qmmp-0.1.3.1/lib/qmmp/Input/flac/decoder_flac.cpp: In member function                                             ‘virtual bool DecoderFLAC::initialize()’:
/root/Deps/qmmp-0.1.3.1/lib/qmmp/Input/flac/decoder_flac.cpp:419: error: ‘flac_c                                            allback_seek’ was not declared in this scope
/root/Deps/qmmp-0.1.3.1/lib/qmmp/Input/flac/decoder_flac.cpp:420: error: ‘flac_c                                            allback_tell’ was not declared in this scope
/root/Deps/qmmp-0.1.3.1/lib/qmmp/Input/flac/decoder_flac.cpp:421: error: ‘flac_c                                            allback_length’ was not declared in this scope
/root/Deps/qmmp-0.1.3.1/lib/qmmp/Input/flac/decoder_flac.cpp:426: error: ‘FLAC__                                            stream_decoder_init_stream’ was not declared in this scope
/root/Deps/qmmp-0.1.3.1/lib/qmmp/Input/flac/decoder_flac.cpp:426: error: ‘FLAC__                                            STREAM_DECODER_INIT_STATUS_OK’ was not declared in this scope
/root/Deps/qmmp-0.1.3.1/lib/qmmp/Input/flac/decoder_flac.cpp: In member function                                             ‘virtual void DecoderFLAC::run()’:
/root/Deps/qmmp-0.1.3.1/lib/qmmp/Input/flac/decoder_flac.cpp:502: error: ‘FLAC__                                            stream_decoder_seek_absolute’ was not declared in this scope
make[2]: *** [lib/qmmp/Input/flac/CMakeFiles/flac.dir/decoder_flac.o] Error 1
make[1]: *** [lib/qmmp/Input/flac/CMakeFiles/flac.dir/all] Error 2
make: *** [all] Error 2

Re: Qmmp не собирается.

Ух как перекорячило =)

По теме: похоже, что версия флака старовата. надо как минимум 0.1.3, а ещё лучше 0.1.4. Если ни того ни дрого нет, то лучше отключить через ccmake

anonymous ()

Re: Qmmp не собирается.

Ух как перекорячило =)

По теме: похоже, что версия флака старовата. надо как минимум 0.1.3, а ещё лучше 0.1.4. Если ни того ни другого нет, то лучше отключить через ccmake

anonymous ()
Вы не можете добавлять комментарии в эту тему. Тема перемещена в архив.