LINUX.ORG.RU

amarok рпи компиляции вываливается с ошибкой


0

0

<code> /libanalyzers.la ../../amarok/src/plugin/libplugin.la ../../amarok/src/statusbar/libstatusbar.la ../../amarok/src/metadata/libmetadata.la -lkutils -lkio -lkdeui -lkdecore -lkhtml -lknewstuff -L/usr/lib -ltag -lGL ../../amarok/src/sqlite/libsqlite.la /usr/kde/3.5/lib/libkhtml.so: undefined reference to `__cxa_get_exception_ptr@CXXABI_1.3.1' collect2: ld returned 1 exit status make[4]: *** [amarokapp] Ошибка 1 make[4]: Leaving directory `/var/tmp/portage/amarok-1.4.3-r1/work/amarok-1.4.3/amarok/src' make[3]: *** [all-recursive] Ошибка 1 make[3]: Leaving directory `/var/tmp/portage/amarok-1.4.3-r1/work/amarok-1.4.3/amarok/src' make[2]: *** [all-recursive] Ошибка 1 make[2]: Leaving directory `/var/tmp/portage/amarok-1.4.3-r1/work/amarok-1.4.3/amarok' make[1]: *** [all-recursive] Ошибка 1 make[1]: Leaving directory `/var/tmp/portage/amarok-1.4.3-r1/work/amarok-1.4.3' make: *** [all] Ошибка 2

!!! ERROR: media-sound/amarok-1.4.3-r1 failed. Call stack: ebuild.sh, line 1546: Called dyn_compile ebuild.sh, line 937: Called src_compile amarok-1.4.3-r1.ebuild, line 75: Called kde_src_compile kde.eclass, line 164: Called kde_src_compile 'all' kde.eclass, line 319: Called kde_src_compile 'myconf' 'configure' 'make' kde.eclass, line 315: Called die </code>

anonymous

Ответ на: комментарий от cod

[1] i686-pc-linux-gnu-3.4.6 [2] i686-pc-linux-gnu-3.4.6-hardened [3] i686-pc-linux-gnu-3.4.6-hardenednopie [4] i686-pc-linux-gnu-3.4.6-hardenednopiessp [5] i686-pc-linux-gnu-3.4.6-hardenednossp [6] i686-pc-linux-gnu-4.1.1 *

anonymous
()
Вы не можете добавлять комментарии в эту тему. Тема перемещена в архив.