LINUX.ORG.RU

Проблемы при сборке Amarok 1.3.9


0

0

Вот решил собрать Amarok 1.3.9 и сразу такие грабли

app.cpp:458: error: `StringHandler' is not a class or namespace app.cpp:458: error: invalid base-class specification app.cpp: In member function `void App::applySettings(bool)': app.cpp:567: error: 'class TagLib::ID3v1::Tag' has no member named ' setStringHandler' app.cpp:570: error: 'class TagLib::ID3v1::Tag' has no member named ' setStringHandler' make[4]: *** [app.o] Ошибка 1 make[4]: Leaving directory `/home/tmp/amarok-1.3.9/amarok/src' make[3]: *** [all-recursive] Ошибка 1 make[3]: Leaving directory `/home/tmp/amarok-1.3.9/amarok/src' make[2]: *** [all-recursive] Ошибка 1 make[2]: Leaving directory `/home/tmp/amarok-1.3.9/amarok' make[1]: *** [all-recursive] Ошибка 1 make[1]: Leaving directory `/home/tmp/amarok-1.3.9' make: *** [all] Ошибка 2

Какие есть соображения? P.S. Дистр Slackware 10.2 Спасибо

Re: Проблемы при сборке Amarok 1.3.9

Просмотрите весь лог ./configure. В конце он может сказать, что всё OK, хотя могут отсутствовать необходимые для компиляции файлы.

Nachti ()

Re: Проблемы при сборке Amarok 1.3.9

амарок 1.3.9 есть в репозитории

качай .tgz шник и не парся..

hard_sintex ()
Вы не можете добавлять комментарии в эту тему. Тема перемещена в архив.