LINUX.ORG.RU

Gentoo ошибка при компиляции.


0

0

Не собирается openssl. Ошибка происходит при обновлении пакета. gcc-4.1.2
Messages for package dev-libs/openssl-0.9.8e-r2:
eng_padlock.c: В функции ‘padlock_xcrypt_ecb’
eng_padlock.c:445: ошибка: can't find a register in class ‘GENERAL_REGS’ while reloading ‘asm’
make[2]: *** [eng_padlock.o] Ошибка 1

make[2]: Leaving directory `/var/tmp/portage/dev-libs/openssl-0.9.8e-r2/work/openssl-0.9.8e/crypto/engine'
make[1]: *** [subdirs] Ошибка 1
make[1]: Leaving directory `/var/tmp/portage/dev-libs/openssl-0.9.8e-r2/work/openssl-0.9.8e/crypto'
make: *** [build_crypto] Ошибка 1
*
* ERROR: dev-libs/openssl-0.9.8e-r2 failed.
* Call stack:
* ebuild.sh, line 1654: Called dyn_compile
* ebuild.sh, line 990: Called qa_call 'src_compile'
* ebuild.sh, line 44: Called src_compile
* openssl-0.9.8e-r2.ebuild, line 112: Called die
*
* make all failed
* If you need support, post the topmost build error, and the call stack if relevant.
* A complete build log is located at '/var/tmp/portage/dev-libs/openssl-0.9.8e-r2/temp/build.log'.


Re: Gentoo ошибка при компиляции.

Ну и что они там не чешутся? Могли бы исправить, больше месяца не компилилось, вот щас руки дошли до исправления.

Druxa ()
Вы не можете добавлять комментарии в эту тему. Тема перемещена в архив.