LINUX.ORG.RU

Gentoo vs libgpg-error


0

0

Снова странный баг:

  errno.c -o libgpg_error_la-code-to-errno.o >/dev/null 2>&1
 * 
 * If you need support, post the topmost build error, and the call stack if relevant.
 * A complete build log is located at '/mnt/d/tmp/portage/dev-libs/libgpg-error-1.6/temp/build.log'.
 * 

 * Messages for package dev-libs/libgpg-error-1.6:

 * 
 * ERROR: dev-libs/libgpg-error-1.6 failed.
 * Call stack:
 *                 ebuild.sh, line 1701:  Called dyn_compile
 *                 ebuild.sh, line 1039:  Called qa_call 'src_compile'
 *                 ebuild.sh, line   44:  Called src_compile
 *   libgpg-error-1.6.ebuild, line   28:  Called die
 * The specific snippet of code:
 *   	emake || die
 *  The die message:
 *   (no error message)
 * 
 * If you need support, post the topmost build error, and the call stack if relevant.
 * A complete build log is located at '/mnt/d/tmp/portage/dev-libs/libgpg-error-1.6/temp/build.log'.
 *

В чем дело может быть?
★★★★★

Re: Gentoo vs libgpg-error

Дело в том, что оно не собралось. Какая именно ошибка, написано выше скопированного текста. То, что приведено — это сообщение portage, а не непосредственно сообщение об ошибке.

mo3r ()
Ответ на: Re: Gentoo vs libgpg-error от mo3r

Re: Gentoo vs libgpg-error

Охотно верю

/bin/sh ../libtool --tag=CC --mode=compile i686-pc-linux-gnu-gcc -DHAVE_CONFIG_H -I. -I.. -DLOCALEDIR=\"/usr/share/locale\" -O2 -march=pentium4 -pipe -fomit-frame-pointer -mmmx -msse -msse2 -MT libgpg_error_la-code-from-errno.lo -MD -MP -MF .deps/libgpg_error_la-code-from-errno.Tpo -c -o libgpg_error_la-code-from-errno.lo `test -f 'code-from-errno.c' || echo './'`code-from-errno.c i686-pc-linux-gnu-gcc -DHAVE_CONFIG_H -I. -I.. -DLOCALEDIR=\"/usr/share/locale\" -O2 -march=pentium4 -pipe -fomit-frame-pointer -mmmx -msse -msse2 -MT libgpg_error_la-code-from-errno.lo -MD -MP -MF .deps/libgpg_error_la-code-from-errno.Tpo -c code-from-errno.c -fPIC -DPIC -o .libs/libgpg_error_la-code-from-errno.o In file included from code-from-errno.c:32: code-from-errno.h:3: error: expected identifier or '(' before '}' token code-from-errno.c: In function 'gpg_err_code_from_errno': code-from-errno.c:68: error: expected expression before ')' token code-from-errno.c:68: error: expected expression before ')' token code-from-errno.c:79: error: 'err_code_from_index' undeclared (first use in this function) code-from-errno.c:79: error: (Each undeclared identifier is reported only once code-from-errno.c:79: error: for each function it appears in.) code-from-errno.c: In function 'gpg_err_code_from_syserror': code-from-errno.c:95: error: expected expression before ')' token code-from-errno.c:95: error: expected expression before ')' token code-from-errno.c:106: error: 'err_code_from_index' undeclared (first use in this function) make[3]: *** [libgpg_error_la-code-from-errno.lo] Ошибка 1 make[3]: Leaving directory `/mnt/d/tmp/portage/dev-libs/libgpg-error-1.6/work/libgpg-error-1.6/src' make[2]: *** [all] Ошибка 2 make[2]: Leaving directory `/mnt/d/tmp/portage/dev-libs/libgpg-error-1.6/work/libgpg-error-1.6/src' make[1]: *** [all-recursive] Ошибка 1 make[1]: Leaving directory `/mnt/d/tmp/portage/dev-libs/libgpg-error-1.6/work/libgpg-error-1.6' make: *** [all] Ошибка 2 * * ERROR: dev-libs/libgpg-error-1.6 failed. * Call stack: * ebuild.sh, line 1701: Called dyn_compile * ebuild.sh, line 1039: Called qa_call 'src_compile' * ebuild.sh, line 44: Called src_compile * libgpg-error-1.6.ebuild, line 28: Called die * The specific snippet of code: * emake || die * The die message: * (no error message) * * If you need support, post the topmost build error, and the call stack if relevant. * A complete build log is located at '/mnt/d/tmp/portage/dev-libs/libgpg-error-1.6/temp/build.log'. *

michwill ★★★★★ ()
Ответ на: Re: Gentoo vs libgpg-error от michwill

Re: Gentoo vs libgpg-error

/bin/sh ../libtool --tag=CC --mode=compile i686-pc-linux-gnu-gcc -DHAVE_CONFIG_H -I. -I.. -DLOCALEDIR=\"/usr/share/locale\" -O2 -march=pentium4 -pipe -fomit-frame-pointer -mmmx -msse -msse2 -MT libgpg_error_la-code-from-errno.lo -MD -MP -MF .deps/libgpg_error_la-code-from-errno.Tpo -c -o libgpg_error_la-code-from-errno.lo `test -f 'code-from-errno.c' || echo './'`code-from-errno.c i686-pc-linux-gnu-gcc -DHAVE_CONFIG_H -I. -I.. -DLOCALEDIR=\"/usr/share/locale\" -O2 -march=pentium4 -pipe -fomit-frame-pointer -mmmx -msse -msse2 -MT libgpg_error_la-code-from-errno.lo -MD -MP -MF .deps/libgpg_error_la-code-from-errno.Tpo -c code-from-errno.c -fPIC -DPIC -o .libs/libgpg_error_la-code-from-errno.o In file included from code-from-errno.c:32: code-from-errno.h:3: error: expected identifier or '(' before '}' token code-from-errno.c: In function 'gpg_err_code_from_errno': code-from-errno.c:68: error: expected expression before ')' token code-from-errno.c:68: error: expected expression before ')' token code-from-errno.c:79: error: 'err_code_from_index' undeclared (first use in this function) code-from-errno.c:79: error: (Each undeclared identifier is reported only once code-from-errno.c:79: error: for each function it appears in.) code-from-errno.c: In function 'gpg_err_code_from_syserror': code-from-errno.c:95: error: expected expression before ')' token code-from-errno.c:95: error: expected expression before ')' token code-from-errno.c:106: error: 'err_code_from_index' undeclared (first use in this function) make[3]: *** [libgpg_error_la-code-from-errno.lo] Ошибка 1 make[3]: Leaving directory `/mnt/d/tmp/portage/dev-libs/libgpg-error-1.6/work/libgpg-error-1.6/src' make[2]: *** [all] Ошибка 2 make[2]: Leaving directory `/mnt/d/tmp/portage/dev-libs/libgpg-error-1.6/work/libgpg-error-1.6/src' make[1]: *** [all-recursive] Ошибка 1 make[1]: Leaving directory `/mnt/d/tmp/portage/dev-libs/libgpg-error-1.6/work/libgpg-error-1.6' make: *** [all] Ошибка 2 * * ERROR: dev-libs/libgpg-error-1.6 failed. * Call stack: * ebuild.sh, line 1701: Called dyn_compile * ebuild.sh, line 1039: Called qa_call 'src_compile' * ebuild.sh, line 44: Called src_compile * libgpg-error-1.6.ebuild, line 28: Called die * The specific snippet of code: * emake || die * The die message: * (no error message) * * If you need support, post the topmost build error, and the call stack if relevant. * A complete build log is located at '/mnt/d/tmp/portage/dev-libs/libgpg-error-1.6/temp/build.log'. *

гребаная капча

michwill ★★★★★ ()
Ответ на: Re: Gentoo vs libgpg-error от michwill

Re: Gentoo vs libgpg-error

 i686-pc-linux-gnu-gcc -DHAVE_CONFIG_H -I. -I.. -DLOCALEDIR=\"/usr/share/locale\" -O2 -march=pentium4 -pipe -fomit-frame-pointer -mmmx -msse -msse2 -MT libgpg_error_la-code-from-errno.lo -MD -MP -MF .deps/libgpg_error_la-code-from-errno.Tpo -c code-from-errno.c  -fPIC -DPIC -o .libs/libgpg_error_la-code-from-errno.o
In file included from code-from-errno.c:32:
code-from-errno.h:3: error: expected identifier or '(' before '}' token
code-from-errno.c: In function 'gpg_err_code_from_errno':
code-from-errno.c:68: error: expected expression before ')' token
code-from-errno.c:68: error: expected expression before ')' token
code-from-errno.c:79: error: 'err_code_from_index' undeclared (first use in this function)
code-from-errno.c:79: error: (Each undeclared identifier is reported only once
code-from-errno.c:79: error: for each function it appears in.)
code-from-errno.c: In function 'gpg_err_code_from_syserror':
code-from-errno.c:95: error: expected expression before ')' token
code-from-errno.c:95: error: expected expression before ')' token
code-from-errno.c:106: error: 'err_code_from_index' undeclared (first use in this function)
make[3]: *** [libgpg_error_la-code-from-errno.lo] Ошибка 1
make[3]: Leaving directory `/mnt/d/tmp/portage/dev-libs/libgpg-error-1.6/work/libgpg-error-1.6/src'
make[2]: *** [all] Ошибка 2
make[2]: Leaving directory `/mnt/d/tmp/portage/dev-libs/libgpg-error-1.6/work/libgpg-error-1.6/src'
make[1]: *** [all-recursive] Ошибка 1
make[1]: Leaving directory `/mnt/d/tmp/portage/dev-libs/libgpg-error-1.6/work/libgpg-error-1.6'
make: *** [all] Ошибка 2
 * 
 * ERROR: dev-libs/libgpg-error-1.6 failed.
 * Call stack:
 *                 ebuild.sh, line 1701:  Called dyn_compile
 *                 ebuild.sh, line 1039:  Called qa_call 'src_compile'
 *                 ebuild.sh, line   44:  Called src_compile
 *   libgpg-error-1.6.ebuild, line   28:  Called die
 * The specific snippet of code:
 *   	emake || die
 *  The die message:
 *   (no error message)
 * 
 * If you need support, post the topmost build error, and the call stack if relevant.
 * A complete build log is located at '/mnt/d/tmp/portage/dev-libs/libgpg-error-1.6/temp/build.log'.
 * 
блин

anonymous ()
Вы не можете добавлять комментарии в эту тему. Тема перемещена в архив.