LINUX.ORG.RU

Не компилируется GCC

 ,


0

3

решил попробывать LFS собрать...

при компиляции gcc ошибки:

In file included from ../../gcc/cp/except.c:1023:0:
cfns.gperf: In function 'const char* libc_name_p(const char*, unsigned int)':
cfns.gperf:101:1: error: 'const char* libc_name_p(const char*, unsigned int)' redeclared inline with 'gnu_inline' attribute
cfns.gperf:26:14: note: 'const char* libc_name_p(const char*, unsigned int)' previously declared here
cfns.gperf: At global scope:
cfns.gperf:26:14: warning: inline function 'const char* libc_name_p(const char*, unsigned int)' used but never defined
make[2]: *** [Makefile:1065: cp/except.o] Error 1
make[2]: *** Waiting for unfinished jobs....
rm gcc.pod
make[2]: Leaving directory '/home/lfs/mnt/sources/gcc-5.3.0/build/gcc'
make[1]: *** [Makefile:4105: all-gcc] Error 2
make[1]: Leaving directory '/home/lfs/mnt/sources/gcc-5.3.0/build'
make: *** [Makefile:859: all] Error 2

система арч, ему надо gcc не старше 5.3??? енто из-за несоответствия версии такая ошибка? стоит 6.1.1


По вашей ошибке в лоб гуглится это https://gcc.gnu.org/bugzilla/show_bug.cgi?id=69959 . Какая у вас revision того, что вы называете 5.3.0? В целом, LFS принято собирать в точности по хэндбуку, любые отклонения от номеров версий могут дать грабли при сборке или потом, при использовании.

mky ★★★★★ ()
Ответ на: комментарий от mky

как на арч поставить gcc-5.3.0 что бы скомпилить ентот 5.3.0??? при попытке установить с аура gcc-4.7 так же вылетает ошибка..

по гуглению ничо не могу понять, везде английский. в переводе ничо не панятна чо надо сделать

safocl ()
Ответ на: комментарий от safocl

короче чото даже 6.1 gcc не хатит собираться в чем трабла не могу понять, при конфигурации пишет чо все впаряде, если бы было чото не установлено конфигурация не прохадила бы...

safocl ()

стоит 6.1.1

Зачем такое новое, у нас на слаке 5.3, нормально пахает

Reedych ★☆ ()
Ответ на: комментарий от Reedych

ну я при чем из аура не могу поставить, не компилится и все, любое более старое...

safocl ()
Ответ на: комментарий от safocl

блин пичаль, с ентой траблой справился, теперь еще одна... теперь не может найти файл при чексумме

opening cp/constraint.o: No such file or directory
safocl ()
Вы не можете добавлять комментарии в эту тему. Тема перемещена в архив.