LINUX.ORG.RU

Опять KDevelop


0

0

скачал KDevelop3CVS при компеляции выдаёт
/usr/bin/ld: cannot find -lart_lgpl_2
collect2: ld returned 1 exit status
make[3]: *** [libkdevelop.la] Ошибка 1
make[3]: Выход из каталог `/home/alexsy/KdevelopCVS/kdevelop/lib'
make[2]: *** [all-recursive] Ошибка 1
make[2]: Выход из каталог `/home/alexsy/KdevelopCVS/kdevelop/lib'
make[1]: *** [all-recursive] Ошибка 1
make[1]: Выход из каталог `/home/alexsy/KdevelopCVS/kdevelop'
make: *** [all] Ошибка 2
таже эта ошибка повторяеться при компеляции любого проекта
подскажите что делать !!! пожалуйста

★★

Re: Опять KDevelop

Он же тебе английским по чёрному написал

cannot find -lart_lgpl_2

вот и ищи где она лежит, а затем клади её в /usr/lib.

cyclon ★★★★★ ()

Re: Опять KDevelop

Госпадин CICLON не нашол я этот файл к какому пакету он пренадлежит ???

alexsy ★★ ()
Ответ на: Re: Опять KDevelop от cyclon

Re: Re: Опять KDevelop

В хелпе к КДевелоп перечисляются пакеты, которые необходимы ему. Проверь - все ли у тебя установлены.

YagMort ★★ ()
Ответ на: Re: Re: Опять KDevelop от anonymous

Re: Опять KDevelop

Всем спасибо за отклик, нашол самостоятельно Эну как всегда сначало спрашиваю потом думаю и нахожу

alexsy ★★ ()
Ответ на: Re: Опять KDevelop от alexsy

Re: Re: Опять KDevelop

Падумай и нойди учебник по рускаму языку рулезззная вещ!!

anonymous ()
Вы не можете добавлять комментарии в эту тему. Тема перемещена в архив.