LINUX.ORG.RU

make & fixdep


0

0

Пытаюсь компилировать ядро(а его компилить я умею) вылетает вот такой список ошибок.Ядро 2.6.8, система Debian Sarge testing
HOSTCC scripts/basic/fixdep
scripts/basic/fixdep.c:97:23: sys/types.h: No such file or directory
scripts/basic/fixdep.c:98:22: sys/stat.h: No such file or directory
scripts/basic/fixdep.c:99:22: sys/mman.h: No such file or directory
scripts/basic/fixdep.c:100:20: unistd.h: No such file or directory
scripts/basic/fixdep.c:101:19: fcntl.h: No such file or directory
scripts/basic/fixdep.c:102:20: string.h: No such file or directory
scripts/basic/fixdep.c:103:20: stdlib.h: No such file or directory
scripts/basic/fixdep.c:104:19: stdio.h: No such file or directory
In file included from /usr/lib/gcc-lib/i486-linux/3.3.5/include/syslimits.h:7,
from /usr/lib/gcc-lib/i486-linux/3.3.5/include/limits.h:11,
from scripts/basic/fixdep.c:105:
/usr/lib/gcc-lib/i486-linux/3.3.5/include/limits.h:122:75: limits.h: No such fil e or directory
scripts/basic/fixdep.c:106:19: ctype.h: No such file or directory
scripts/basic/fixdep.c:107:24: netinet/in.h: No such file or directory
scripts/basic/fixdep.c: In function `usage':
scripts/basic/fixdep.c:121: warning: implicit declaration of function `fprintf'
scripts/basic/fixdep.c:121: error: `stderr' undeclared (first use in this functi on)
scripts/basic/fixdep.c:121: error: (Each undeclared identifier is reported only once
scripts/basic/fixdep.c:121: error: for each function it appears in.)
scripts/basic/fixdep.c:122: warning: implicit declaration of function `exit'
scripts/basic/fixdep.c: In function `print_cmdline':
scripts/basic/fixdep.c:127: warning: implicit declaration of function `printf'
scripts/basic/fixdep.c: At top level:
scripts/basic/fixdep.c:130: error: `NULL' undeclared here (not in a function)
scripts/basic/fixdep.c: In function `grow_config':
scripts/basic/fixdep.c:143: warning: implicit declaration of function `realloc'
scripts/basic/fixdep.c:143: warning: assignment makes pointer from integer witho ut a cast
scripts/basic/fixdep.c:144: error: `NULL' undeclared (first use in this function )
scripts/basic/fixdep.c:145: warning: implicit declaration of function `perror'
scripts/basic/fixdep.c: In function `is_defined_config':
scripts/basic/fixdep.c:161: warning: implicit declaration of function `memcmp'
scripts/basic/fixdep.c: In function `define_config':
scripts/basic/fixdep.c:174: warning: implicit declaration of function `memcpy'
scripts/basic/fixdep.c: In function `use_config':
scripts/basic/fixdep.c:193: error: `PATH_MAX' undeclared (first use in this func tion)
scripts/basic/fixdep.c:207: warning: implicit declaration of function `tolower'
scripts/basic/fixdep.c:193: warning: unused variable `s'
scripts/basic/fixdep.c: At top level:
scripts/basic/fixdep.c:212: error: parse error before "size_t"
scripts/basic/fixdep.c:213: warning: function declaration isn't a prototype
scripts/basic/fixdep.c: In function `parse_config_file':
scripts/basic/fixdep.c:214: error: `map' undeclared (first use in this function)
scripts/basic/fixdep.c:214: error: `len' undeclared (first use in this function)
scripts/basic/fixdep.c:220: warning: implicit declaration of function `ntohl'
scripts/basic/fixdep.c:231: warning: implicit declaration of function `isalnum'
scripts/basic/fixdep.c: In function `strrcmp':
scripts/basic/fixdep.c:244: warning: implicit declaration of function `strlen'
scripts/basic/fixdep.c: In function `do_config_file':
scripts/basic/fixdep.c:255: error: storage size of `st' isn't known
scripts/basic/fixdep.c:259: warning: implicit declaration of function `open'
scripts/basic/fixdep.c:259: error: `O_RDONLY' undeclared (first use in this func tion)
scripts/basic/fixdep.c:261: error: `stderr' undeclared (first use in this functi on)
scripts/basic/fixdep.c:265: warning: implicit declaration of function `fstat'
scripts/basic/fixdep.c:267: warning: implicit declaration of function `close'
scripts/basic/fixdep.c:270: warning: implicit declaration of function `mmap'
scripts/basic/fixdep.c:270: error: `NULL' undeclared (first use in this function )
scripts/basic/fixdep.c:270: error: `PROT_READ' undeclared (first use in this fun ction)
scripts/basic/fixdep.c:270: error: `MAP_PRIVATE' undeclared (first use in this f unction)
scripts/basic/fixdep.c:270: warning: assignment makes pointer from integer witho ut a cast
scripts/basic/fixdep.c:279: warning: implicit declaration of function `munmap'
scripts/basic/fixdep.c:255: warning: unused variable `st'
scripts/basic/fixdep.c: At top level:
scripts/basic/fixdep.c:284: error: parse error before "size_t"
scripts/basic/fixdep.c:285: warning: function declaration isn't a prototype
scripts/basic/fixdep.c: In function `parse_dep_file':
scripts/basic/fixdep.c:286: error: `map' undeclared (first use in this function)
scripts/basic/fixdep.c:287: error: `len' undeclared (first use in this function)
scripts/basic/fixdep.c:289: error: `PATH_MAX' undeclared (first use in this func tion)
scripts/basic/fixdep.c:291: warning: implicit declaration of function `strchr'
scripts/basic/fixdep.c:293: error: `stderr' undeclared (first use in this functi on)
scripts/basic/fixdep.c:289: warning: unused variable `s'
scripts/basic/fixdep.c: In function `print_deps':
scripts/basic/fixdep.c:325: error: storage size of `st' isn't known
scripts/basic/fixdep.c:329: error: `O_RDONLY' undeclared (first use in this func tion)
scripts/basic/fixdep.c:331: error: `stderr' undeclared (first use in this functi on)
scripts/basic/fixdep.c:341: error: `NULL' undeclared (first use in this function )
scripts/basic/fixdep.c:341: error: `PROT_READ' undeclared (first use in this fun ction)
scripts/basic/fixdep.c:341: error: `MAP_PRIVATE' undeclared (first use in this f unction)
scripts/basic/fixdep.c:341: warning: assignment makes pointer from integer witho ut a cast
scripts/basic/fixdep.c:325: warning: unused variable `st'
scripts/basic/fixdep.c: In function `traps':
scripts/basic/fixdep.c:360: error: `stderr' undeclared (first use in this functi on)
make[1]: *** [scripts/basic/fixdep] Ошибка 1
make: *** [scripts_basic] Ошибка 2


Re: make & fixdep

Похоже gcc не видит kernel headers, попробуй сначала дать команду

export CPATH="{KERNELSRCROOT}/include/" (в bash-е)

а затем уже

make config && make && и т.д.

au ()
Ответ на: Re: make & fixdep от Deleted

Re: make & fixdep

Хедеры оказались ни причем надо было лишь libncurses поставить.

niro ()

Re: make & fixdep

>Хедеры ядра вообще не установлены.

заголовочные файлы идут вместе с исходным кодом ядра, глянь в {kernel.src.root}/include

>Хедеры оказались ни причем надо было лишь libncurses поставить.

вот сюда посмотри

scripts/basic/fixdep.c:97:23: sys/types.h: No such file or directory

sys/types.h это один из заголовочных файлов ядра! То что ты поставил ncurses и gcc стал видеть заголовки ядра это совсем другой вопрос...

au ()
Вы не можете добавлять комментарии в эту тему. Тема перемещена в архив.