LINUX.ORG.RU

Ребят помогите разобраться, установка хочет ncurses


0

1

Ребят помогите разобраться, установка хочет ncurses Поставил sudo apt-get install libncurses5-dev

все равно: kconfig/lxdialog/checklist.o: In function `print_item': checklist.c:(.text+0x3a): undefined reference to `wmove' checklist.c:(.text+0x54): undefined reference to `waddch' checklist.c:(.text+0x7a): undefined reference to `wmove'

Ответ на: комментарий от anonymous

«ребят» ты увидишь завтра в своём 7-м «А»

В твоём 7-м «Б» девочек вообще нет что ли?

anonymous ()

Правильнее вопросы надо задавать с предоставлением всех возможных данных, вплоть до расцветки трусов у разработчика.

Куда ставил, какой дистрибутив, на какое железо и полный выхлоп ошибки, где?

anonymous ()
Ответ на: комментарий от anonymous

да в том то и дело, весь листинг в терминале большой и остается кусок вот этой ерунды, а никаких log файлов не наблюдается ставил croosstools, ошибка при сt-ng menuconfig

по памяти помню, было что no such file or directory curses.h но curses установлен 100%

Signal ()
Ответ на: комментарий от Dragon59

Да сейчас другу версию crosstoolsa ставлю build идет, тока что-то мне кажется он там тож матерился на ерунду одну сечас вроде исправил, если что будет новый вопрос))))

Signal ()
Ответ на: комментарий от Signal

[ALL ] [ALL ] libc/sysdeps/linux/mips/crt1.S: Assembler messages: [ALL ] libc/sysdeps/linux/mips/crt1.S:117: Warning: No .cprestore pseudo-op used in PIC code [ALL ] libc/sysdeps/linux/mips/crt1.S: Assembler messages: [ALL ] libc/sysdeps/linux/mips/crt1.S:117: Warning: No .cprestore pseudo-op used in PIC code [ALL ] AS lib/crti.o [ALL ] AS lib/crtn.o [ALL ] {standard input}: Assembler messages: [ALL ] {standard input}: Error: .size expression for _init does not evaluate to a constant [ALL ] {standard input}: Error: .size expression for _fini does not evaluate to a constant [ERROR] make[2]: *** [lib/crtn.o] Error 1 [ALL ] make[2]: *** Waiting for unfinished jobs.... [ALL ] make[2]: Leaving directory `/home/www/build/.build/mips-unknown-linux-uclibc/build/build-libc' [ERROR] [ERROR] >> [ERROR] >> Build failed in step 'Installing C library' [ERROR] >> called in step '(top-level)' [ERROR] >> [ERROR] >> Error happened in: CT_DoExecLog[scripts/functions@172] [ERROR] >> called from: do_libc[scripts/build/libc/uClibc.sh@196] [ERROR] >> called from: main[scripts/crosstool-NG.sh@598] [ERROR] >> [ERROR] >> For more info on this error, look at the file: 'build.log' [ERROR] >> There is a list of known issues, some with workarounds, in: [ERROR] >> '/home/www/ctng/share/doc/crosstool-ng/ct-ng.1.15.2/B - Known issues.txt' [ERROR] [ERROR] (elapsed: 13:34.31)

Signal ()
Ответ на: комментарий от null123

Это капча для новоявленных регистрантов, чсх >70% не проходят :3

anonymous ()
Ответ на: комментарий от anonymous_sama

благодарить не буду, ))) я это видел, у меня другая версия crosstoolsa это не катит, пробовал

Signal ()
Ответ на: комментарий от Signal

у меня другая версия crosstoolsa это не катит

как хорошо, что ты прислушался к совету выше о том, чтобы более полно излагать информацию, и сообщил нам версию с которой у тебя не получается

shrub ★★★★★ ()

Может стоило sudo apt-get install libncurses5? На кой чёрт тебе девелоперские библиотеки и прочее? Или компилишь с нуля?

agentgoblin ()

Может ncurses под mips сначала собрать?

mittorn ★★★★★ ()
Вы не можете добавлять комментарии в эту тему. Тема перемещена в архив.