LINUX.ORG.RU

не компилится модуль


0

1

root@debian:/lib/modules/2.6.32-5-686# uname -a Linux debian 2.6.32-5-686 #1 SMP Mon Oct 3 04:15:24 UTC 2011 i686 GNU/Linux root@debian:~/tw68-0.0.5# make make -C /lib/modules/2.6.32-5-686/build M=/root/tw68-0.0.5 modules make: *** /lib/modules/2.6.32-5-686/build: Нет такого файла или каталога. Останов. make: *** [all] Ошибка 2 root@debian:~/tw68-0.0.5# ls /lib/modules/2.6.32-5-686/ kernel modules.alias.bin modules.dep.bin modules.order modules.symbols modules.alias modules.dep modules.devname modules.softdep modules.symbols.bin

Чего не хватает?

он же тебе ясно написал - каталога build не хватает

mlyaghost ()
Ответ на: комментарий от mlyaghost

каталог создал

каталог создал, теперь ругается: root@debian:~/tw68-0.0.5# ls -l итого 192 -rw-r--r-- 1 user user 863 Июл 27 20:40 btcx-risc.h drwxr-xr-x 3 user user 4096 Июл 28 22:25 debian -rw-r--r-- 1 user user 2161 Июл 27 20:40 Makefile -rw-r--r-- 1 user user 4519 Июл 27 20:40 README -rw-r--r-- 1 user user 4837 Июл 27 22:04 tw68-cards.c -rw-r--r-- 1 user user 32011 Июл 27 21:40 tw68-core.c -rw-r--r-- 1 user user 16019 Июл 28 13:52 tw68.h -rw-r--r-- 1 user user 6574 Июл 27 20:40 tw68-i2c.c -rw-r--r-- 1 user user 5817 Июл 27 20:40 tw68-reg.h -rw-r--r-- 1 user user 8434 Июл 27 20:40 tw68-risc.c -rw-r--r-- 1 user user 1719 Июл 27 20:40 tw68-ts.c -rw-r--r-- 1 user user 1929 Июл 27 20:40 tw68-tvaudio.c -rw-r--r-- 1 user user 2379 Июл 27 20:40 tw68-vbi.c -rw-r--r-- 1 user user 56922 Июл 27 21:16 tw68-video.c -rw-r--r-- 1 user user 12344 Июл 27 20:40 videotest.c root@debian:~/tw68-0.0.5# make make -C /lib/modules/2.6.32-5-686/build M=/root/tw68-0.0.5 modules make[1]: Entering directory `/lib/modules/2.6.32-5-686/build' make[1]: *** Нет правила для сборки цели `modules'. Останов. make[1]: Leaving directory `/lib/modules/2.6.32-5-686/build' make: *** [all] Ошибка 2 root@debian:~/tw68-0.0.5#

yurissan ()
Ответ на: каталог создал от yurissan

root@debian:~/tw68-0.0.5# make make -C /lib/modules/2.6.32-5-686/build M=/root/tw68-0.0.5 modules make[1]: Entering directory `/lib/modules/2.6.32-5-686/build' make[1]: *** Нет правила для сборки цели `modules'. Останов. make[1]: Leaving directory `/lib/modules/2.6.32-5-686/build' make: *** [all] Ошибка 2 root@debian:~/tw68-0.0.5# ls btcx-risc.h debian Makefile README tw68-cards.c tw68-core.c tw68.h tw68-i2c.c tw68-reg.h tw68-risc.c tw68-ts.c tw68-tvaudio.c tw68-vbi.c tw68-video.c videotest.c

yurissan ()

Во-первых, осиль LORCODE

Во-вторых покажи Makefile.

anonymous ()

сдается мне ты не в той папке компилишь...

Pinkbyte ★★★★★ ()
Вы не можете добавлять комментарии в эту тему. Тема перемещена в архив.