LINUX.ORG.RU

В нескольких обновляемых kde* пакетах появилась ошибка при сборке: Makefile:127: recipe for target 'all' failed

 ,


0

1
SOURCE -D_REENTRANT -D_XOPEN_SOURCE=500 -o /var/tmp/portage/kde-base/korganizer-4.14.5/work/korganizer-4.14.5_build/korganizer/moc_kowhatsnextview.cpp /var/tmp/portage/kde-base/korganizer-4.14.5/work/korganizer-4.14.5/korganizer/views/whatsnextview/kowhatsnextview.h 
make[2]: Leaving directory '/var/tmp/portage/kde-base/korganizer-4.14.5/work/korganizer-4.14.5_build'
/usr/bin/cmake -E cmake_progress_report /var/tmp/portage/kde-base/korganizer-4.14.5/work/korganizer-4.14.5_build/CMakeFiles  88
[  9%] Built target korganizerprivate_automoc
make[1]: Leaving directory '/var/tmp/portage/kde-base/korganizer-4.14.5/work/korganizer-4.14.5_build'
Makefile:127: recipe for target 'all' failed
make: *** [all] Error 2

Все они версии 4.14.5, обновляюсь с 4.14.3

Кто-нибудь сталкивался?

★★★★★

Вот они:

>>> Emerging (1 of 4) kde-base/kdepim-common-libs-4.14.5::kde
>>> Failed to emerge kde-base/kdepim-common-libs-4.14.5, Log file:
>>>  '/var/tmp/portage/kde-base/kdepim-common-libs-4.14.5/temp/build.log'
>>> Jobs: 0 of 4 complete, 1 failed                 Load avg: 14.9, 8.3, 9.3
*** Resuming merge...
Calculating depende                         ... done! 
>>> Emerging (1 of 3) kde-base/korganizer-4.14.5::kde
>>> Failed to emerge kde-base/korganizer-4.14.5, Log file:
>>>  '/var/tmp/portage/kde-base/korganizer-4.14.5/temp/build.log'
>>> Jobs: 0 of 3 complete, 1 failed                 Load avg: 8.14, 7.37, 8.92
*** Resuming merge...
     ... done!                     
>>> Emerging (1 of 2) kde-base/kaddressbook-4.14.5::kde
>>> Failed to emerge kde-base/kaddressbook-4.14.5, Log file:
>>>  '/var/tmp/portage/kde-base/kaddressbook-4.14.5/temp/build.log'
>>> Jobs: 0 of 2 complete, 1 failed                 Load avg: 5.80, 6.71, 8.59
*** Resuming merge...
Calculating depende                        ... done!  
>>> Emerging (1 of 1) kde-base/kmail-4.14.5::kde
>>> Failed to emerge kde-base/kmail-4.14.5, Log file:
>>>  '/var/tmp/portage/kde-base/kmail-4.14.5/temp/build.log'
>>> Jobs: 0 of 1 complete, 1 failed                 Load avg: 13.3, 10.9, 9.8

deterok ★★★★★ ()
Ответ на: комментарий от Pinkbyte

Так, вот на этом органайзер сыпется (даже с флагом -j1), возможно виноват новый компилятор(gcc-4.9.2). Сейчас проверю старым.

[ 13%] Building CXX object calendarsupport/CMakeFiles/calendarsupportcollectionpage.dir/collectiongeneralpage.o
cd /var/tmp/portage/kde-base/korganizer-4.14.5/work/korganizer-4.14.5_build/calendarsupport && /usr/bin/x86_64-pc-linux-gnu-g++  -DKDE4_CMAKE_TOPLEVEL_DIR_LENGTH=48 -DKDE_DEPRECATED_WARNINGS -DMAKE_CALENDARSUPPORTCOLLECTIONPAGE_LIB -DQT_NO_CAST_FROM_ASCII -DQT_NO_CAST_TO_ASCII -DQT_NO_STL -DQT_USE_QSTRINGBUILDER -D_BSD_SOURCE -D_DEFAULT_SOURCE -D_REENTRANT -D_XOPEN_SOURCE=500  -DQT_NO_DEBUG -DNDEBUG -march=core-avx-i -mcx16 -msahf -mno-movbe -maes -mpclmul -mpopcnt -mno-abm -mno-lwp -mno-fma -mno-fma4 -mno-xop -mno-bmi -mno-bmi2 -mno-tbm -mavx -mno-avx2 -msse4.2 -msse4.1 -mno-lzcnt -mno-rtm -mno-hle -mrdrnd -mf16c -mfsgsbase -mno-rdseed -mno-prfchw -mno-adx -mfxsr -mxsave -mxsaveopt --param l1-cache-size=32 --param l1-cache-line-size=64 --param l2-cache-size=6144 -mtune=core-avx-i -O2 -pipe  -Wnon-virtual-dtor -Wno-long-long -Wundef -Wcast-align -Wchar-subscripts -Wall -W -Wpointer-arith -Wformat-security -fno-exceptions -DQT_NO_EXCEPTIONS -fno-check-new -fno-common -Woverloaded-virtual -fno-threadsafe-statics -fvisibility=hidden -fvisibility-inlines-hidden -fexceptions -UQT_NO_EXCEPTIONS -fPIC -I/var/tmp/portage/kde-base/korganizer-4.14.5/work/korganizer-4.14.5_build/calendarsupport -I/var/tmp/portage/kde-base/korganizer-4.14.5/work/korganizer-4.14.5/calendarsupport -I/var/tmp/portage/kde-base/korganizer-4.14.5/work/korganizer-4.14.5 -I/var/tmp/portage/kde-base/korganizer-4.14.5/work/korganizer-4.14.5_build -I/var/tmp/portage/kde-base/korganizer-4.14.5/work/korganizer-4.14.5/mailcommon -I/var/tmp/portage/kde-base/korganizer-4.14.5/work/korganizer-4.14.5/pimcommon -I/usr/include/KDE -I/usr/include/qt4/QtXmlPatterns -I/usr/include/qt4/QtXml -I/usr/include/qt4/QtWebKit -I/usr/include/qt4/QtUiTools -I/usr/include/qt4/QtTest -I/usr/include/qt4/QtSvg -I/usr/include/qt4/QtSql -I/usr/include/qt4/QtScriptTools -I/usr/include/qt4/QtScript -I/usr/include/qt4/QtOpenGL -I/usr/include/qt4/QtNetwork -I/usr/include/qt4/QtMultimedia -I/usr/include/qt4/QtHelp -I/usr/include/qt4/QtDesigner -I/usr/include/qt4/QtDeclarative -I/usr/include/qt4/QtDBus -I/usr/include/qt4/Qt3Support -I/usr/include/qt4/QtGui -I/usr/include/qt4/QtCore -I/usr/include/qt4/Qt -I/usr/share/qt4/mkspecs/default -I/usr/include/qt4    -D_GNU_SOURCE -D_LARGEFILE64_SOURCE -o CMakeFiles/calendarsupportcollectionpage.dir/collectiongeneralpage.o -c /var/tmp/portage/kde-base/korganizer-4.14.5/work/korganizer-4.14.5/calendarsupport/collectiongeneralpage.cpp
/var/tmp/portage/kde-base/korganizer-4.14.5/work/korganizer-4.14.5/calendarsupport/collectiongeneralpage.cpp:41:70: fatal error: mailcommon/collectionpage/collectionannotationsattribute.h: No such file or directory
 #include <mailcommon/collectionpage/collectionannotationsattribute.h>
                                                                      ^
compilation terminated.
calendarsupport/CMakeFiles/calendarsupportcollectionpage.dir/build.make:54: recipe for target 'calendarsupport/CMakeFiles/calendarsupportcollectionpage.dir/collectiongeneralpage.o' failed
make[2]: *** [calendarsupport/CMakeFiles/calendarsupportcollectionpage.dir/collectiongeneralpage.o] Error 1
make[2]: Leaving directory '/var/tmp/portage/kde-base/korganizer-4.14.5/work/korganizer-4.14.5_build'
CMakeFiles/Makefile2:176: recipe for target 'calendarsupport/CMakeFiles/calendarsupportcollectionpage.dir/all' failed
make[1]: *** [calendarsupport/CMakeFiles/calendarsupportcollectionpage.dir/all] Error 2
make[1]: Leaving directory '/var/tmp/portage/kde-base/korganizer-4.14.5/work/korganizer-4.14.5_build'
Makefile:127: recipe for target 'all' failed
make: *** [all] Error 2
 * ERROR: kde-base/korganizer-4.14.5::kde failed (compile phase):
 *   emake failed
 * 
 * If you need support, post the output of `emerge --info '=kde-base/korganizer-4.14.5::kde'
deterok ★★★★★ ()
Ответ на: комментарий от cchr

Ок, спасибо, а я чего-то затупил, надо было сразу по багтрекеру прошерстить.

deterok ★★★★★ ()
Вы не можете добавлять комментарии в эту тему. Тема перемещена в архив.