LINUX.ORG.RU

не получаеться откомпелить socks5 под FC3


0

0

не получаеться откомпелить socks5 под FC3
In file included from ./commands.c:86:
/usr/lib/gcc/i386-redhat-linux/3.4.2/include/varargs.h:4:2: #error "GCC no longer implements <varargs.h>."
/usr/lib/gcc/i386-redhat-linux/3.4.2/include/varargs.h:5:2: #error "Revise your code to use <stdarg.h>."
./commands.c:2096: error: syntax error before "va_dcl"
./commands.c:2097: error: syntax error before '{' token
./commands.c:2104: warning: parameter names (without types) in function declaration
./commands.c:2104: warning: data definition has no type or storage class
./commands.c:2105: error: conflicting types for 'routine'
./commands.c:2100: error: previous declaration of 'routine' was here
./commands.c:2105: error: `ap' undeclared here (not in a function)
./commands.c:2105: error: syntax error before "intrtn_t"
./commands.c:2109: warning: parameter names (without types) in function declaration
./commands.c:2109: warning: data definition has no type or storage class
./commands.c:2110: error: syntax error before "return"
./commands.c:125: warning: 'call' used but never defined
make[2]: *** [commands.o] Ошибка 1
make[2]: Цель `all' не была пересобрана из-за ошибок.
make[2]: Leaving directory `/home/alexsy/redhat/BUILD/socks5-v1.0r11/clients/telnet'
make[1]: *** [all] Ошибка 2
make[1]: Leaving directory `/home/alexsy/redhat/BUILD/socks5-v1.0r11/clients'
make: *** [clients] Ошибка 2

★★

Re: не получаеться откомпелить socks5 под FC3

написано же буквами "Revise your code to use <stdarg.h>" словарик и медитировать ... что за сорцы ?

robot12 ★★★★★ ()
Вы не можете добавлять комментарии в эту тему. Тема перемещена в архив.