LINUX.ORG.RU

Не устанавливается AMD-APP-SDK-2.7


0

1

Пытаюсь установить AMD-APP-SDK-2.7, но мне пишет ошибки, разъясните что надо исправить :


robin@robin-GA-990FXA-UD3:/opt/AMDAPP$ make
make -C samples
make[1]: Entering directory `/opt/AMDAPP/samples'
make -C opencl
make[2]: Entering directory `/opt/AMDAPP/samples/opencl'
make -C SDKUtil
make[3]: Entering directory `/opt/AMDAPP/samples/opencl/SDKUtil'
mkdir -p build/debug/x86_64/
Building build/debug/x86_64//SDKApplication.og++ -Wpointer-arith -Wfloat-equal -g3 -ffor-scope -I ../../../samples/opencl/SDKUtil/include -I include -I «/opt/AMDAPP/include» -I ../../../include -o build/debug/x86_64//SDKApplication.o -c SDKApplication.cpp /bin/sh: 1: g++: not found
make[3]: *** [build/debug/x86_64//SDKApplication.o] Error 127
make[3]: Leaving directory `/opt/AMDAPP/samples/opencl/SDKUtil'
make[2]: *** [SDKUtil] Error 2
make[2]: Leaving directory `/opt/AMDAPP/samples/opencl'
make[1]: *** [opencl] Error 2
make[1]: Leaving directory `/opt/AMDAPP/samples'
make: *** [samples] Error 2
robin@robin-GA-990FXA-UD3:/opt/AMDAPP$

А оно в наше время зачем-то нужно?!

erfea ★★★★★ ()

/bin/sh: 1: g++: not found

aptitude install build-essential, если deb-beased дистр.

HTaeD ★★★★ ()
Вы не можете добавлять комментарии в эту тему. Тема перемещена в архив.