LINUX.ORG.RU

Проблемы с компиляцией tme

 


0

1

Задался целью скомпилировать tme, но make вываливается с ошибкой:

module.c: In function 'tme_module_init':
module.c:93:3: error: 'lt_preloaded_symbols' undeclared (first use in this function)
module.c:93:3: note: each undeclared identifier is reported only once for each function it appears in
make[4]: *** [module.lo] Error 1
make[4]: Leaving directory `/home/keed/emu/tme-0.8/libtme'
make[3]: *** [all-recursive] Error 1
make[3]: Leaving directory `/home/keed/emu/tme-0.8/libtme'
make[2]: *** [all] Error 2
make[2]: Leaving directory `/home/keed/emu/tme-0.8/libtme'
make[1]: *** [all-recursive] Error 1
make[1]: Leaving directory `/home/keed/emu/tme-0.8'
make: *** [all] Error 2
Может кто-то знает, что не так?

Ответ на: комментарий от KERNEL_PANIC

Что б суть уловил

Читать пробовал?

anonymous ()

module.c:93:3: ошибка: необъявленная 'lt_preloaded_symbols' (первое использование в этой функции)

saahriktu ★★★★★ ()
Вы не можете добавлять комментарии в эту тему. Тема перемещена в архив.