LINUX.ORG.RU

не компилируются модули


0

0

сабж

заканчивается все этим:

/usr/src/linux-2.4.20-8/include/linux/module.h:184: warning: function declaration isn't a prototype
/usr/src/linux-2.4.20-8/include/linux/module.h:185: `inter_module_get_R_ver_str' declared as function returning a function
/usr/src/linux-2.4.20-8/include/linux/module.h:185: warning: parameter names (without types) in function declaration
/usr/src/linux-2.4.20-8/include/linux/module.h:186: `inter_module_get_request_R_ver_str' declared as function returning a function
/usr/src/linux-2.4.20-8/include/linux/module.h:186: warning: parameter names (without types) in function declaration
/usr/src/linux-2.4.20-8/include/linux/module.h:187: invalid suffix on integer constant
/usr/src/linux-2.4.20-8/include/linux/module.h:187: parse error before numeric constant
/usr/src/linux-2.4.20-8/include/linux/module.h:187: `inter_module_put_R_ver_str' declared as function returning a function
/usr/src/linux-2.4.20-8/include/linux/module.h:187: warning: function declaration isn't a prototype
/usr/src/linux-2.4.20-8/include/linux/module.h:196: `try_inc_mod_count_R_ver_str' declared as function returning a function
/usr/src/linux-2.4.20-8/include/linux/module.h:196: warning: parameter names (without types) in function declaration
make[2]: *** [dummy.o] Ошибка 1
make[2]: Выход из каталог `/usr/src/linux-2.4.20-8/drivers/net'
make[1]: *** [_modsubdir_net] Ошибка 2
make[1]: Выход из каталог `/usr/src/linux-2.4.20-8/drivers'
make: *** [_mod_drivers] Ошибка 2


что где как мне делать???

anonymous

Re: не компилируются модули

а make mrproper делал?

Delay ★★ ()

Re: не компилируются модули

2Delay (*) (2003-09-04 21:06:56.310382)
сделал. скомпилировась 8) спасибо

anonymous ()
Вы не можете добавлять комментарии в эту тему. Тема перемещена в архив.