LINUX.ORG.RU

NVIDIA driver: error при сборке


0

0

NVIDIA_kernel-1.0-4191 Версия gcc 3.2.2 (RedHat9) Вот что мне выдает при сборке (это только ошибки (2>)): In file included from /lib/modules/2.4.20-8custom/build/include/linux/vmalloc.h:8, from nv-linux.h:64, from nv.c:14: /lib/modules/2.4.20-8custom/build/include/linux/highmem.h: In function `bh_kmap': /lib/modules/2.4.20-8custom/build/include/linux/highmem.h:20: warning: pointer of type `void *' used in arithmetic nv.c: In function `nv_kern_mmap': nv.c:1282: warning: passing arg 1 of `remap_page_range_R2baf18f2' makes pointer from integer without a cast nv.c:1282: incompatible type for argument 4 of `remap_page_range_R2baf18f2' nv.c:1282: too few arguments to function `remap_page_range_R2baf18f2' nv.c:1301: warning: passing arg 1 of `remap_page_range_R2baf18f2' makes pointer from integer without a cast nv.c:1301: incompatible type for argument 4 of `remap_page_range_R2baf18f2' nv.c:1301: too few arguments to function `remap_page_range_R2baf18f2' nv.c:1387: warning: passing arg 1 of `remap_page_range_R2baf18f2' makes pointer from integer without a cast nv.c:1387: incompatible type for argument 4 of `remap_page_range_R2baf18f2' nv.c:1387: too few arguments to function `remap_page_range_R2baf18f2' nv.c: In function `nv_get_phys_address': nv.c:2250: warning: implicit declaration of function `pte_offset' nv.c:2250: invalid type argument of `unary *' make: *** [nv.o] Error 1


Re: NVIDIA driver: error при сборке

Дрова поновее есть. 4363

Hirnfuhler ★★ ()

Re: NVIDIA driver: error при сборке

Тоесть новый номана должны пойти? щас качну.

DuSoft ()
Вы не можете добавлять комментарии в эту тему. Тема перемещена в архив.