LINUX.ORG.RU
ФорумAdmin

No rule to make target `check' при создании пакета iptables


0

1

День добрый, возникла такая проблема.
Делаю по http://help.ubuntu.ru/wiki/создание_deb_пакетов. Собираю пакет iptables 1.4.11, скачал сырец, скачал готовый пакет 1.4.10-1, взял от туда папку debian, скопировал куда надо.
(http://mirror.yandex.ru/debian/pool/main/i/iptables/iptables_1.4.10-1.debian.... - папка debian, которую брал)
Вобщем, dpkg-buildpackage -rfakeroot вываливается в самом конце с таким:


make[2]: Entering directory `/var/src/inst/iptables-1.4.11/debian/build'
Making check in extensions
make[3]: Entering directory `/var/src/inst/iptables-1.4.11/debian/build/extensions'
make[3]: *** No rule to make target `check'. Stop.
make[3]: Leaving directory `/var/src/inst/iptables-1.4.11/debian/build/extensions'
make[2]: *** [check-recursive] Error 1
make[2]: Leaving directory `/var/src/inst/iptables-1.4.11/debian/build'
dh_auto_test: make -j1 check returned exit code 2
make[1]: *** [debian/stamp-build] Error 29
make[1]: Leaving directory `/var/src/inst/iptables-1.4.11/debian/build'
make: *** [build] Error 2
dpkg-buildpackage: error: debian/rules build gave error exit status 2

Подскажите, что делать, это мой первый раз :)

override_dh_auto_check:
echo «No checking here»

Как-то так?

AITap ★★★★★ ()
Ответ на: комментарий от PATRI0T

Ой. Попробуйте dh_auto_test вместо check, я ошибся.

AITap ★★★★★ ()
Ответ на: комментарий от AITap

Спасибо тебе большое, мил человек. Очень помог, все собралось.

PATRI0T ()
Вы не можете добавлять комментарии в эту тему. Тема перемещена в архив.