LINUX.ORG.RU
ФорумAdmin

Ошибка при компиляции Апача


0

0

При компиляции Апача возникает следующая ошибка:

</usr/include/bits/local_lim.h:27: linux/limits.h: No such file or directory

make[3]: *** [regcomp.o] Error 1

make[2]: *** [subdirs] Error 1

make[2]: Leaving directory `/tmp/apache_1.3.19/src'

make[1]: *** [build-std] Error 2

make[1]: Leaving directory `/tmp/apache_1.3.19'

make: *** [build] Error 2

Помогите плз! Я кажется чего-нибудь сбиблиотеками намудрил!

anonymous

Re: Ошибка при компиляции Апача

у меня оно в /usr/include/limits.h /usr/src/linux-2.2.19/include/linux/limits.h так что поставь исходники ядра

mator ★★★★★ ()
Вы не можете добавлять комментарии в эту тему. Тема перемещена в архив.