LINUX.ORG.RU

Сообщения some_x

 

Чем читают sgml?

Форум — General

subj

some_x ()

Траблы с ppp соединением

Форум — General

Парился я с модемом, теперь он вроде работает, но инет не пашет, вот что пишет pppd:
Jul 20 17:08:14 some_x_MDK pppd[3085]: pppd 2.4.1 started by root, uid 0
Jul 20 17:08:14 some_x_MDK pppd[3085]: Using interface ppp0
Jul 20 17:08:14 some_x_MDK pppd[3085]: Connect: ppp0 <--> /dev/tts/4
Jul 20 17:08:14 some_x_MDK pppd[3085]: local  IP address 217.18.139.236
Jul 20 17:08:14 some_x_MDK pppd[3085]: remote IP address 217.18.128.3
Jul 20 17:08:14 some_x_MDK pppd[3085]: primary   DNS address 217.18.130.30
Jul 20 17:08:14 some_x_MDK pppd[3085]: secondary DNS address 217.18.138.30
Jul 20 17:09:40 some_x_MDK pppd[3085]: Terminating on signal 15.
Jul 20 17:09:40 some_x_MDK pppd[3085]: Connection terminated.
Jul 20 17:09:40 some_x_MDK pppd[3085]: Connect time 1.5 minutes.
Jul 20 17:09:40 some_x_MDK pppd[3085]: Sent 87 bytes, received 66 bytes.
Jul 20 17:09:40 some_x_MDK pppd[3085]: Exit.
Звонил kppp и wvdial, в kppp выставлял ip - динамический, DNS и динамический и статический, всё одно браузер страницу не находит(mozilla, lynx, konquer)
В винде всё пашет, в чём может быть причина.
some_x ()

Не могу поставить модем

Форум — Linux-hardware

Вот за полторы тысячи, специально ради линукса купил хардварный модем usrobotics 56k 2976, а он чё то не пашет, KDE`шная звонилка тормозится на инициализации, а при опросе все строки(ATI1,...) пустые, под виндой всё ОК, чо делать?

some_x ()

winex3 + Prфetorians = sound trabls

Форум — Games

У меня на мандрейке 9.1 со звуковухой via8233 subj(Музыка заикается, шипение треск), раньше с таким не встречался, ктонить знает чо делать?

some_x ()

Установка линуха по сетке

Форум — Linux-install

Хочу поставить Mandrake 9.1 через сеть(находится на винте другого компа в отдельной ext2 партиции в развёрнутом виде), как это сделать?

some_x ()

Помогте скачать файл

Форум — Talks

У меня трабла, в городе есть халявный инет центр, но там так настроено что прямы ссылки на не html(и ещё пар форматов перехватываются) а я бы хотел скачать win4lin и свежий кернел, помогите плиз

some_x ()

Задолбался с компиляцией ядра в Мандрейке 9.1

Форум — General

У меня при компиляции ядра возникает такая трабла:
sa11xx-uda1341.c:104: parse error before "dma_device_t"
sa11xx-uda1341.c:104: warning: no semicolon at end of struct or union
sa11xx-uda1341.c:105: warning: type defaults to `int' in declaration of `dma_regs'
sa11xx-uda1341.c:105: warning: data definition has no type or storage class
sa11xx-uda1341.c:107: parse error before ':' token
sa11xx-uda1341.c:116: parse error before '}' token
sa11xx-uda1341.c:116: warning: type defaults to `int' in declaration of `audio_stream_t'
sa11xx-uda1341.c:116: warning: data definition has no type or storage class
sa11xx-uda1341.c:124: parse error before "audio_stream_t"
sa11xx-uda1341.c:124: warning: no semicolon at end of struct or union
sa11xx-uda1341.c:125: warning: type defaults to `int' in declaration of `sa11xx_uda1341_t'
sa11xx-uda1341.c:125: warning: data definition has no type or storage class
sa11xx-uda1341.c:157:2: #error This driver could serve H3x00 handhelds only!
sa11xx-uda1341.c: In function `sa11xx_uda1341_set_audio_clock':
sa11xx-uda1341.c:164: `GPCR' undeclared (first use in this function)
sa11xx-uda1341.c:164: (Each undeclared identifier is reported only once
sa11xx-uda1341.c:164: for each function it appears in.)
sa11xx-uda1341.c:164: warning: implicit declaration of function `GPIO_GPIO'
sa11xx-uda1341.c:168: `GPSR' undeclared (first use in this function)
sa11xx-uda1341.c: At top level:
sa11xx-uda1341.c:183: parse error before '*' token
sa11xx-uda1341.c:184: warning: function declaration isn't a prototype
sa11xx-uda1341.c: In function `sa11xx_uda1341_set_samplerate':
sa11xx-uda1341.c:191: `Ser4SSCR0' undeclared (first use in this function)
sa11xx-uda1341.c:191: `SSCR0_SSE' undeclared (first use in this function)
sa11xx-uda1341.c:201: `rate' undeclared (first use in this function)
sa11xx-uda1341.c:236: warning: implicit declaration of function `SSCR0_SerClkDiv'
sa11xx-uda1341.c:255: warning: implicit declaration of function `l3_command'
sa11xx-uda1341.c:255: dereferencing pointer to incomplete type
sa11xx-uda1341.c:257: dereferencing pointer to incomplete type
sa11xx-uda1341.c:260: dereferencing pointer to incomplete type
sa11xx-uda1341.c: At top level:
sa11xx-uda1341.c:267: parse error before '*' token
sa11xx-uda1341.c:268: warning: function declaration isn't a prototype
sa11xx-uda1341.c: In function `sa11xx_uda1341_audio_init':
sa11xx-uda1341.c:274: dereferencing pointer to incomplete type
sa11xx-uda1341.c:275: dereferencing pointer to incomplete type
sa11xx-uda1341.c:276: dereferencing pointer to incomplete type
sa11xx-uda1341.c:277: dereferencing pointer to incomplete type
sa11xx-uda1341.c:277: `DMA_Ser4SSPWr' undeclared (first use in this function)
sa11xx-uda1341.c:280: dereferencing pointer to incomplete type
sa11xx-uda1341.c:281: dereferencing pointer to incomplete type
sa11xx-uda1341.c:282: dereferencing pointer to incomplete type
sa11xx-uda1341.c:283: dereferencing pointer to incomplete type
sa11xx-uda1341.c:283: `DMA_Ser4SSPRd' undeclared (first use in this function)
sa11xx-uda1341.c:290: `GAFR' undeclared (first use in this function)
sa11xx-uda1341.c:290: `GPIO_SSP_CLK' undeclared (first use in this function)
sa11xx-uda1341.c:291: `GPDR' undeclared (first use in this function)
sa11xx-uda1341.c:292: `Ser4SSCR0' undeclared (first use in this function)
sa11xx-uda1341.c:293: warning: implicit declaration of function `SSCR0_DataSize'
sa11xx-uda1341.c:293: `SSCR0_TI' undeclared (first use in this function)
sa11xx-uda1341.c:294: `Ser4SSCR1' undeclared (first use in this function)
sa11xx-uda1341.c:294: `SSCR1_SClkIactL' undeclared (first use in this function)
sa11xx-uda1341.c:294: `SSCR1_SClk1P' undeclared (first use in this function)
sa11xx-uda1341.c:294: `SSCR1_ExtClk' undeclared (first use in this function)
sa11xx-uda1341.c:295: `SSCR0_SSE' undeclared (first use in this function)
sa11xx-uda1341.c:299: warning: implicit declaration of function `clr_sa11xx_uda1341_egpio'
sa11xx-uda1341.c:299: `IPAQ_EGPIO_CODEC_NRESET' undeclared (first use in this function)
sa11xx-uda1341.c:300: warning: implicit declaration of function `set_sa11xx_uda1341_egpio'
sa11xx-uda1341.c:300: `IPAQ_EGPIO_AUDIO_ON' undeclared (first use in this function)
sa11xx-uda1341.c:301: `IPAQ_EGPIO_QMUTE' undeclared (first use in this function)
sa11xx-uda1341.c:304: warning: implicit declaration of function `l3_open'
sa11xx-uda1341.c:304: dereferencing pointer to incomplete type
sa11xx-uda1341.c:316: `Ser4SSDR' undeclared (first use in this function)
sa11xx-uda1341.c: At top level:
sa11xx-uda1341.c:321: parse error before '*' token
sa11xx-uda1341.c:322: warning: function declaration isn't a prototype
sa11xx-uda1341.c: In function `sa11xx_uda1341_audio_shutdown':
sa11xx-uda1341.c:324: `IPAQ_EGPIO_QMUTE' undeclared (first use in this function)
sa11xx-uda1341.c:327: warning: implicit declaration of function `l3_close'
sa11xx-uda1341.c:327: dereferencing pointer to incomplete type
sa11xx-uda1341.c:328: `Ser4SSCR0' undeclared (first use in this function)
sa11xx-uda1341.c:329: `IPAQ_EGPIO_CODEC_NRESET' undeclared (first use in this function)
sa11xx-uda1341.c:331: `IPAQ_EGPIO_AUDIO_ON' undeclared (first use in this function)
sa11xx-uda1341.c: At top level:
sa11xx-uda1341.c:347: parse error before '*' token
sa11xx-uda1341.c:347: parse error before ')' token
sa11xx-uda1341.c:355: warning: type defaults to `int' in declaration of `ret'
sa11xx-uda1341.c:355: warning: implicit declaration of function `sa1100_request_dma'
sa11xx-uda1341.c:355: `s' undeclared here (not in a function)
sa11xx-uda1341.c:355: `s' undeclared here (not in a function)
sa11xx-uda1341.c:355: `callback' undeclared here (not in a function)
sa11xx-uda1341.c:355: `s' undeclared here (not in a function)
sa11xx-uda1341.c:355: `s' undeclared here (not in a function)
sa11xx-uda1341.c:355: initializer element is not constant
sa11xx-uda1341.c:355: warning: data definition has no type or storage class
sa11xx-uda1341.c:357: parse error before '}' token
sa11xx-uda1341.c:359: parse error before '*' token
sa11xx-uda1341.c:360: warning: function declaration isn't a prototype
sa11xx-uda1341.c: In function `audio_dma_free':
sa11xx-uda1341.c:361: warning: implicit declaration of function `sa1100_free_dma'
sa11xx-uda1341.c:361: `s' undeclared (first use in this function)
sa11xx-uda1341.c: At top level:
sa11xx-uda1341.c:365: parse error before '*' token
sa11xx-uda1341.c:366: warning: function declaration isn't a prototype
sa11xx-uda1341.c: In function `audio_get_dma_pos':
sa11xx-uda1341.c:367: `s' undeclared (first use in this function)
sa11xx-uda1341.c:376: warning: implicit declaration of function `sa1100_get_dma_pos'
sa11xx-uda1341.c: At top level:
sa11xx-uda1341.c:398: parse error before '*' token
sa11xx-uda1341.c:399: warning: function declaration isn't a prototype
sa11xx-uda1341.c: In function `audio_stop_dma':
sa11xx-uda1341.c:408: `s' undeclared (first use in this function)
sa11xx-uda1341.c:418: warning: implicit declaration of function `sa1100_clear_dma'
sa11xx-uda1341.c: At top level:
sa11xx-uda1341.c:422: parse error before '*' token
sa11xx-uda1341.c:423: warning: function declaration isn't a prototype
sa11xx-uda1341.c: In function `audio_reset':
sa11xx-uda1341.c:426: `s' undeclared (first use in this function)
sa11xx-uda1341.c: At top level:
sa11xx-uda1341.c:433: parse error before '*' token
sa11xx-uda1341.c:434: warning: function declaration isn't a prototype
sa11xx-uda1341.c: In function `audio_process_dma':
sa11xx-uda1341.c:435: `s' undeclared (first use in this function)
sa11xx-uda1341.c:447: warning: implicit declaration of function `sa1100_start_dma'
sa11xx-uda1341.c:447: `FLUSH_BASE_PHYS' undeclared (first use in this function)
sa11xx-uda1341.c:476: `MAX_DMA_SIZE' undeclared (first use in this function)
sa11xx-uda1341.c:479: `CUT_DMA_SIZE' undeclared (first use in this function)
sa11xx-uda1341.c: In function `audio_dma_callback':
sa11xx-uda1341.c:511: `s' undeclared (first use in this function)
sa11xx-uda1341.c:512: warning: unused variable `buf'
sa11xx-uda1341.c:513: warning: unused variable `i'
sa11xx-uda1341.c: In function `snd_card_sa11xx_uda1341_pcm_trigger':
sa11xx-uda1341.c:548: `chip' undeclared (first use in this function)
sa11xx-uda1341.c:548: parse error before ')' token
sa11xx-uda1341.c:549: warning: unused variable `runtime'
sa11xx-uda1341.c:550: warning: unused variable `i'
sa11xx-uda1341.c: In function `snd_card_sa11xx_uda1341_playback_open':
sa11xx-uda1341.c:678: `chip' undeclared (first use in this function)
sa11xx-uda1341.c:678: parse error before ')' token
sa11xx-uda1341.c: In function `snd_card_sa11xx_uda1341_playback_close':
sa11xx-uda1341.c:706: `chip' undeclared (first use in this function)
sa11xx-uda1341.c:706: parse error before ')' token
sa11xx-uda1341.c: In function `snd_card_sa11xx_uda1341_playback_prepare':
sa11xx-uda1341.c:724: `chip' undeclared (first use in this function)
sa11xx-uda1341.c:724: parse error before ')' token
sa11xx-uda1341.c: In function `snd_card_sa11xx_uda1341_playback_pointer':
sa11xx-uda1341.c:744: `chip' undeclared (first use in this function)
sa11xx-uda1341.c:744: parse error before ')' token
sa11xx-uda1341.c: In function `snd_card_sa11xx_uda1341_capture_open':
sa11xx-uda1341.c:758: `chip' undeclared (first use in this function)
sa11xx-uda1341.c:758: parse error before ')' token
sa11xx-uda1341.c: In function `snd_card_sa11xx_uda1341_capture_close':
sa11xx-uda1341.c:782: `chip' undeclared (first use in this function)
sa11xx-uda1341.c:782: parse error before ')' token
sa11xx-uda1341.c: In function `snd_card_sa11xx_uda1341_capture_prepare':
sa11xx-uda1341.c:800: `chip' undeclared (first use in this function)
sa11xx-uda1341.c:800: parse error before ')' token
sa11xx-uda1341.c: In function `snd_card_sa11xx_uda1341_capture_pointer':
sa11xx-uda1341.c:820: `chip' undeclared (first use in this function)
sa11xx-uda1341.c:820: parse error before ')' token
sa11xx-uda1341.c: At top level:
sa11xx-uda1341.c:869: parse error before '*' token
sa11xx-uda1341.c:870: warning: function declaration isn't a prototype
sa11xx-uda1341.c: In function `snd_card_sa11xx_uda1341_pcm':
sa11xx-uda1341.c:876: dereferencing pointer to incomplete type
sa11xx-uda1341.c:876: `device' undeclared (first use in this function)
sa11xx-uda1341.c:877: `substreams' undeclared (first use in this function)
sa11xx-uda1341.c:885: warning: implicit declaration of function `snd_pcm_lib_preallocate_isa_pages_for_all'
sa11xx-uda1341.c:893: dereferencing pointer to incomplete type
sa11xx-uda1341.c:894: dereferencing pointer to incomplete type
sa11xx-uda1341.c:899: warning: implicit declaration of function `audio_dma_request'
sa11xx-uda1341.c:899: dereferencing pointer to incomplete type
sa11xx-uda1341.c:900: dereferencing pointer to incomplete type
sa11xx-uda1341.c: In function `sa11xx_uda1341_pm_callback':
sa11xx-uda1341.c:913: invalid operands to binary *
sa11xx-uda1341.c:914: `is' undeclared (first use in this function)
sa11xx-uda1341.c:914: `os' undeclared (first use in this function)
sa11xx-uda1341.c:914: warning: left-hand operand of comma expression has no effect
sa11xx-uda1341.c:923: dereferencing pointer to incomplete type
sa11xx-uda1341.c:924: dereferencing pointer to incomplete type
sa11xx-uda1341.c:931: warning: implicit declaration of function `DMA_CLEAR'
sa11xx-uda1341.c:947: warning: implicit declaration of function `DMA_RESET'
sa11xx-uda1341.c: In function `snd_sa11xx_uda1341_free':
sa11xx-uda1341.c:963: `chip' undeclared (first use in this function)
sa11xx-uda1341.c:963: parse error before ')' token
sa11xx-uda1341.c: In function `sa11xx_uda1341_init':
sa11xx-uda1341.c:987: warning: implicit declaration of function `machine_is_h3xxx'
sa11xx-uda1341.c:994: parse error before ')' token
sa11xx-uda1341.c:1001: dereferencing pointer to incomplete type
sa11xx-uda1341.c:1004: dereferencing pointer to incomplete type
sa11xx-uda1341.c:1004: dereferencing pointer to incomplete type
sa11xx-uda1341.c:1013: dereferencing pointer to incomplete type
sa11xx-uda1341.c:1014: dereferencing pointer to incomplete type
sa11xx-uda1341.c:1015: dereferencing pointer to incomplete type
sa11xx-uda1341.c: In function `sa11xx_uda1341_exit':
sa11xx-uda1341.c:1034: dereferencing pointer to incomplete type
sa11xx-uda1341.c:1035: dereferencing pointer to incomplete type
make[3]: *** [sa11xx-uda1341.o] Ошибка 1
make[3]: Leaving directory `/usr/src/new_linux/sound/arm'
make[2]: *** [first_rule] Ошибка 2
make[2]: Leaving directory `/usr/src/new_linux/sound/arm'
make[1]: *** [_subdir_arm] Ошибка 2
make[1]: Leaving directory `/usr/src/new_linux/sound'

В файле config.help написанно:
CONFIG_SND_SA11XX_UDA1341
Say Y or M if you have a Compaq iPaq H3x00 handheld computer and want
to use its Philips UDA 1341 audio chip.
Причём я поддержку этого "UDA 1341 audio chip", не заказывал, оно мне нафиг не надо и вобше в файле config строчки CONFIG_SND_SA11XX_UDA1341
нет(ни вкаком виде, даже строки 1341 нет), компилится только если поддержку звука полностью отменить, но тогда alsa не компилится, чо делать ума не приложу, может дело в компиляторе(gcc 3.2 точно не помню)

some_x ()

Помогите оптимизировать мандрейк 9.0 под старый комп

Форум — General

Вот поставил на 166MMX 32 RAM linux а он тормозит даже в консоли, как бы его оптимизировать

some_x ()

Исправления к предыдушему посту

Форум — Development

Сори не asci to integer, а integer to asci

some_x ()

itoa

Форум — Development

Не подскажете где бы взять подобную фукцию(ASCI to integer) и еще нельзя ли с помошью printf сделать вывод числа типа int в виде 000 001 045 670, вобшем если число состоит менее чем из трех цифр чтоб нули дорисовывались.

some_x ()

Не компилится элементарная прога...

Форум — General

Вот написал прогу:
#include <stdio.h>
#include <stdlib.h>

int main(int argc, char *argv[])
{
FILE *fp;
short x=1;
if(argc<1) printf("eror \n");
if(fopen(argv[1],"r")==0) printf("File is open\n");
fseek(fp,1L,0);
if(getc(fp)=="\n") printf("Yes\n"); else printf("No\n");

fclose(fp);
return EXIT_SUCCESS;
}
А бинарник выдаёт сегментеёшин фолт(ему похоже не нравится fseek(fp,1L,0);), в чем дело не понимаю

some_x ()

Не компилиься элементарная рога...

Форум — General

Вот написал прогу:
#include <stdio.h>
#include <stdlib.h>

int main(int argc, char *argv[])
{
  FILE *fp;
  short x=1;
  if(argc<1) printf("eror \n");
  if(fopen(argv[1],"r")==0) printf("File is open\n");
  fseek(fp,1L,0);
  if(getc(fp)=="\n") printf("Yes\n"); else printf("No\n");
            
   fclose(fp);
  return EXIT_SUCCESS;
}
А бинарник выдаёт сегментеёшин фолт(ему похоже не нравится fseek(fp,1L,0);), в чем дело не понимаю
some_x ()

Быстрая смена разрешений в Х

Форум — General

Помнится в Мандрейке 7.1 можно было менять разрешение с помошью CTRL+ALT+(+/-), как сделать такое в 9.1?

some_x ()

Проблемы с lilo

Форум — Linux-install

У меня стоит мандрейк 9.1 на диске после 1024-го цилиндра, при попытке запустить команду lilo, она вылетает когда доходит до винды(/dev/hda1), с матами lilo failed: UNSAFE maybe used with floppy or MBR only, чо к чему ума не приложу.

some_x ()

Установка мандрейка на диск после 1024-го цилиндра

Форум — Linux-install

Можно ли поставить мандрейк на диск после 1024-го цилиндра, а если нет то что делать в ситуации когда основной линуховый раздел(6ГБ) после 1024-го цилиндра, а не большой(1ГБ) до 1024-го, смонтировать его в папке /boot?

some_x ()

Грёбаный Мандрак !HELP!

Форум — General

Блин вот решил переустановить Mandrake 9.1(а надо сказать диск у меня был разбит так: 2 ГБ фат32, 2ГБ нтфс, линуховые разделы(5 штук ext3 + swap) и большой фат 32) убил все ext3 разделы(кроме одного), сделал один большой / и начал установку, а после перезагрузки оказалось, что у меня после того самого не тронутого ext3 все разделы снесены и вновь созданый ext3 и ранее существующий фат. Помогите пожалуйста что делать, существует ли прога которая способна просканить диск и сказать, вот тут начинается раздел(где-то же это записано).

some_x ()

Случайно убил иксы

Форум — General

Я тут с /tmp поигрался(скопировал на другой диск и сделал симлинк), а x-Ы сдохли(Could not init font path element unix/:-1, removing from list! Fatal server error: could not open default font 'fixed'), я потом всё на место вернул, но они все равно ругаются, ни чё не понимаю как там могло чо-то удалится и главное чё туперь делать(мож ему ttf-ку подсунуть). P.S Дистр - Mandrake 9.1

some_x ()

HOMM4 и winex3

Форум — Games

Кто-нить запускал сабж от буки и как

some_x ()

wine(x) && promt 2000 winex3 && homm4(RUS)

Форум — Games

Вот и wine и winex3 руссифицировал решил поставить homm4(от Буки), а они не пушаются, пишет в консоли VIRUS WARNING: PE module has an invalid entrypoint (0x0044b7d1) outside all sections (possibly infected by Tchernobyl/SpaceFiller virus)! wine: Unhandled exception, starting debugger... и выдаёт типа не могу загрузить dll. Ещё пытался поставить promt 2000 и под вайном и под вайнексом инсталяция обламывается(правда вайнекс продвигается дальше) ктонить ставил, имеет ли смысл качать crossover office? Заранее благодарен

some_x ()

руссификация winex и другие траблы

Форум — Games

написал [fonts] ;Read the Fonts topic in the Wine User Guide before adding aliases ;See a couple of examples for russian users below "Resolution" = "96" "Default" = "-cronyx-helvetica-" "DefaultFixed" = "fixed" "DefaultSerif" = "-cronyx-times-" "DefaultSansSerif" = "-cronyx-elvetica-"

;; default TrueType fonts with russian koi8-r encoding "Default" = "-monotype-arial-*-*-*--*-*-*-*-*-*-koi8-r" "DefaultFixed" = "-monotype-courier new-*-*-*--*-*-*-*-*-*-koi8-r" "DefaultSerif" = "-monotype-times new roman-*-*-*--*-*-*-*-*-*-koi8-r" "DefaultSansSerif" = "-monotype-arial-*-*-*--*-*-*-*-*-*-koi8-r" ;; default cyrillic bitmap X fonts "Default" = "-cronyx-helvetica-" "DefaultFixed" = "fixed" "DefaultSerif" = "-cronyx-times-" "DefaultSansSerif" = "-cronyx-helvetica-" скопировал фонты из виндов на эмуляцию виндового диска в папку fonts, но это ему не помогает, подскажите че делать. 2)Ещё трабла gta3 тормозит(duron 900, geforce 2 mx400, 256 ddr,kt266A) чтоб от этого избавится нужно разгонять проц или видюху и насколько. 3) Попытался поставить wine из сырцов методом ./configure make depend && make make install, он говорит не могу найти библиотеки, хотя я в l

some_x ()

RSS подписка на новые темы